"molecule_id","FCFP4_1024b948","FCFP4_1024b937","FCFP4_1024b868","FCFP4_1024b1","FCFP4_1024b10","FCFP4_1024b100","FCFP4_1024b1000","FCFP4_1024b1001","FCFP4_1024b1002","FCFP4_1024b1003","FCFP4_1024b1004","FCFP4_1024b1005","FCFP4_1024b1006","FCFP4_1024b1007","FCFP4_1024b1008","FCFP4_1024b1009","FCFP4_1024b101","FCFP4_1024b1010","FCFP4_1024b1011","FCFP4_1024b1012","FCFP4_1024b1013","FCFP4_1024b1014","FCFP4_1024b1015","FCFP4_1024b1016","FCFP4_1024b1017","FCFP4_1024b1018","FCFP4_1024b1019","FCFP4_1024b102","FCFP4_1024b1020","FCFP4_1024b1021","FCFP4_1024b1022","FCFP4_1024b1023","FCFP4_1024b1024","FCFP4_1024b103","FCFP4_1024b104","FCFP4_1024b105","FCFP4_1024b106","FCFP4_1024b107","FCFP4_1024b108","FCFP4_1024b109","FCFP4_1024b11","FCFP4_1024b110","FCFP4_1024b111","FCFP4_1024b112","FCFP4_1024b113","FCFP4_1024b114","FCFP4_1024b115","FCFP4_1024b116","FCFP4_1024b117","FCFP4_1024b118","FCFP4_1024b119","FCFP4_1024b12","FCFP4_1024b120","FCFP4_1024b121","FCFP4_1024b122","FCFP4_1024b123","FCFP4_1024b124","FCFP4_1024b125","FCFP4_1024b126","FCFP4_1024b127","FCFP4_1024b128","FCFP4_1024b129","FCFP4_1024b13","FCFP4_1024b130","FCFP4_1024b131","FCFP4_1024b132","FCFP4_1024b133","FCFP4_1024b134","FCFP4_1024b135","FCFP4_1024b136","FCFP4_1024b137","FCFP4_1024b138","FCFP4_1024b139","FCFP4_1024b14","FCFP4_1024b140","FCFP4_1024b141","FCFP4_1024b142","FCFP4_1024b143","FCFP4_1024b144","FCFP4_1024b145","FCFP4_1024b146","FCFP4_1024b147","FCFP4_1024b148","FCFP4_1024b149","FCFP4_1024b15","FCFP4_1024b150","FCFP4_1024b151","FCFP4_1024b152","FCFP4_1024b153","FCFP4_1024b154","FCFP4_1024b155","FCFP4_1024b156","FCFP4_1024b157","FCFP4_1024b158","FCFP4_1024b159","FCFP4_1024b16","FCFP4_1024b160","FCFP4_1024b161","FCFP4_1024b162","FCFP4_1024b163","FCFP4_1024b164","FCFP4_1024b165","FCFP4_1024b166","FCFP4_1024b167","FCFP4_1024b168","FCFP4_1024b169","FCFP4_1024b17","FCFP4_1024b170","FCFP4_1024b171","FCFP4_1024b172","FCFP4_1024b173","FCFP4_1024b174","FCFP4_1024b175","FCFP4_1024b176","FCFP4_1024b177","FCFP4_1024b178","FCFP4_1024b179","FCFP4_1024b18","FCFP4_1024b180","FCFP4_1024b181","FCFP4_1024b182","FCFP4_1024b183","FCFP4_1024b184","FCFP4_1024b185","FCFP4_1024b186","FCFP4_1024b187","FCFP4_1024b188","FCFP4_1024b189","FCFP4_1024b19","FCFP4_1024b190","FCFP4_1024b191","FCFP4_1024b192","FCFP4_1024b193","FCFP4_1024b194","FCFP4_1024b195","FCFP4_1024b196","FCFP4_1024b197","FCFP4_1024b198","FCFP4_1024b199","FCFP4_1024b2","FCFP4_1024b20","FCFP4_1024b200","FCFP4_1024b201","FCFP4_1024b202","FCFP4_1024b203","FCFP4_1024b204","FCFP4_1024b205","FCFP4_1024b206","FCFP4_1024b207","FCFP4_1024b208","FCFP4_1024b209","FCFP4_1024b21","FCFP4_1024b210","FCFP4_1024b211","pXC50"
{4 1,11 1,73 1,107 1,108 1,140 1,155 4.035}
{0 CHEMBL1075731,4 1,11 1,107 1,108 1,140 1,155 4}
{0 CHEMBL1075838,4 1,11 1,38 1,52 1,107 1,108 1,140 1,155 4.261}
{0 CHEMBL1075857,4 1,11 1,38 1,73 1,107 1,108 1,140 1,155 4.644}
{0 CHEMBL1075905,4 1,11 1,107 1,108 1,140 1,155 4}
{0 CHEMBL1075973,4 1,11 1,38 1,107 1,108 1,140 1,155 4}
{0 CHEMBL1079478,4 1,11 1,38 1,52 1,73 1,107 1,108 1,140 1,155 5.222}
{0 CHEMBL1079479,4 1,11 1,38 1,52 1,73 1,107 1,108 1,140 1,155 5.31}
{0 CHEMBL1079495,4 1,11 1,38 1,107 1,108 1,140 1,155 4.184}
{0 CHEMBL1079660,4 1,11 1,27 1,38 1,107 1,108 1,140 1,155 4}
{0 CHEMBL1079661,4 1,11 1,45 1,67 1,103 1,107 1,108 1,118 1,140 1,155 4}
{0 CHEMBL1079662,4 1,11 1,67 1,107 1,108 1,118 1,140 1,155 4.074}
{0 CHEMBL1079663,4 1,5 1,11 1,107 1,108 1,140 1,155 4}
{0 CHEMBL1079845,4 1,11 1,107 1,108 1,109 1,111 1,140 1,155 4}
{0 CHEMBL1079988,4 1,11 1,39 1,80 1,107 1,108 1,140 1,155 4}
{0 CHEMBL1079989,4 1,11 1,107 1,108 1,118 1,140 1,155 4}
{0 CHEMBL1080016,4 1,11 1,107 1,108 1,140 1,155 4.366}
{0 CHEMBL1080017,4 1,11 1,38 1,67 1,107 1,108 1,118 1,140 1,155 4.481}
{0 CHEMBL1080018,4 1,11 1,38 1,107 1,108 1,140 1,155 4.62}
{0 CHEMBL1080200,4 1,11 1,38 1,73 1,107 1,108 1,140 1,155 4.351}
{0 CHEMBL1080201,4 1,11 1,38 1,73 1,107 1,108 1,140 1,155 4.379}
{0 CHEMBL1080202,4 1,11 1,38 1,73 1,107 1,108 1,140 1,155 4.457}
{0 CHEMBL1080311,4 1,11 1,38 1,73 1,107 1,108 1,140 1,155 4.74}
{0 CHEMBL1080488,4 1,11 1,38 1,52 1,107 1,108 1,140 1,155 4.971}
{0 CHEMBL1080494,4 1,11 1,38 1,52 1,107 1,108 1,140 1,155 4.733}
{0 CHEMBL1080495,4 1,11 1,38 1,73 1,107 1,108 1,140 1,155 4.775}
{0 CHEMBL1080496,4 1,11 1,38 1,73 1,107 1,108 1,140 1,155 4.987}
{0 CHEMBL1080667,4 1,11 1,38 1,52 1,73 1,107 1,108 1,140 1,155 4.943}
{0 CHEMBL1081059,4 1,11 1,18 1,107 1,108 1,140 1,155 4}
{0 CHEMBL1081060,4 1,11 1,38 1,88 1,107 1,108 1,140 1,155 4}
{0 CHEMBL1081578,4 1,11 1,27 1,38 1,52 1,107 1,108 1,140 1,155 5.481}
{0 CHEMBL1081579,4 1,11 1,38 1,52 1,107 1,108 1,122 1,140 1,155 5.854}
{0 CHEMBL1081583,4 1,11 1,107 1,108 1,116 1,140 1,155 4.123}
{0 CHEMBL1081748,4 1,11 1,103 1,107 1,108 1,118 1,140 1,155 4}
{0 CHEMBL1081935,4 1,11 1,107 1,108 1,118 1,140 1,155 4.14}
{0 CHEMBL1081936,4 1,11 1,107 1,108 1,140 1,155 4.21}
{0 CHEMBL1081937,4 1,11 1,107 1,108 1,140 1,155 4.304}
{0 CHEMBL1081955,4 1,11 1,38 1,107 1,108 1,140 1,155 4}
{0 CHEMBL1081956,4 1,11 1,27 1,38 1,52 1,107 1,108 1,140 1,155 5.509}
{0 CHEMBL1082129,4 1,11 1,38 1,73 1,107 1,108 1,140 1,155 4}
{0 CHEMBL1082130,4 1,11 1,38 1,73 1,107 1,108 1,140 1,155 4.167}
{0 CHEMBL1098610,4 1,39 1,67 1,107 1,108 1,140 1,150 1,155 4.032}
{0 CHEMBL1289456,2 1,4 1,36 1,38 1,88 1,107 1,108 1,140 1,150 1,155 4.44}
{0 CHEMBL1289457,4 1,38 1,88 1,107 1,108 1,140 1,150 1,155 4.068}
{0 CHEMBL1289670,4 1,38 1,88 1,107 1,108 1,126 1,140 1,150 1,155 5.097}
{0 CHEMBL151848,4 1,11 1,107 1,108 1,140 1,155 4}
{0 CHEMBL1765359,4 1,36 1,60 1,107 1,108 1,118 1,132 1,139 1,140 1,141 1,155 6.046}
{0 CHEMBL1765360,4 1,18 1,107 1,108 1,118 1,126 1,140 1,155 5.796}
{0 CHEMBL1773168,4 1,38 1,107 1,108 1,140 1,155 4.301}
{0 CHEMBL1773180,4 1,5 1,29 1,61 1,71 1,88 1,107 1,108 1,118 1,140 1,155 4.301}
{0 CHEMBL1773181,4 1,5 1,29 1,71 1,73 1,88 1,107 1,108 1,118 1,140 1,155 4.301}
{0 CHEMBL1784316,4 1,11 1,55 1,83 1,88 1,107 1,108 1,140 1,150 1,155 4.648}
{0 CHEMBL1945186,4 1,39 1,61 1,107 1,108 1,109 1,111 1,120 1,140 1,155 4.873}
{0 CHEMBL1945189,4 1,43 1,61 1,62 1,107 1,108 1,118 1,132 1,139 1,140 1,141 1,145 1,155 5.056}
{0 CHEMBL1945552,4 1,39 1,61 1,67 1,91 1,107 1,108 1,118 1,140 1,150 1,155 4.032}
{0 CHEMBL1946279,4 1,39 1,53 1,67 1,107 1,108 1,118 1,140 1,150 1,155 4}
{0 CHEMBL1946281,4 1,39 1,67 1,107 1,108 1,118 1,140 1,148 1,155 4.567}
{0 CHEMBL1946981,4 1,39 1,91 1,107 1,108 1,116 1,140 1,150 1,155 4.131}
{0 CHEMBL1946982,4 1,39 1,73 1,91 1,107 1,108 1,140 1,150 1,155 4.18}
{0 CHEMBL1946988,4 1,23 1,39 1,61 1,91 1,107 1,108 1,140 1,150 1,155 4.081}
{0 CHEMBL1946992,4 1,39 1,61 1,67 1,107 1,108 1,140 1,150 1,155 4.032}
{0 CHEMBL1946997,4 1,39 1,67 1,107 1,108 1,140 1,150 1,155 4.032}
{0 CHEMBL1946998,4 1,18 1,39 1,67 1,107 1,108 1,140 1,150 1,155 4}
{0 CHEMBL200386,1 1,2 1,3 1,4 1,5 1,57 1,71 1,80 1,88 1,89 1,99 1,107 1,108 1,114 1,118 1,140 1,155 4}
{0 CHEMBL200475,1 1,2 1,4 1,5 1,71 1,88 1,99 1,107 1,108 1,111 1,118 1,140 1,155 4.126}
{0 CHEMBL200830,1 1,2 1,3 1,4 1,5 1,71 1,80 1,88 1,89 1,99 1,107 1,108 1,114 1,118 1,140 1,155 4}
{0 CHEMBL217931,4 1,39 1,61 1,67 1,107 1,108 1,140 1,150 1,155 4.636}
{0 CHEMBL275787,4 1,42 1,53 1,61 1,107 1,108 1,118 1,132 1,139 1,140 1,141 1,154 1,155 5.056}
{0 CHEMBL371922,1 1,2 1,4 1,5 1,57 1,71 1,88 1,99 1,107 1,108 1,114 1,118 1,140 1,155 4}
{0 CHEMBL372159,1 1,2 1,3 1,4 1,5 1,71 1,80 1,88 1,89 1,99 1,107 1,108 1,114 1,118 1,140 1,155 4}
{0 CHEMBL374279,4 1,39 1,61 1,107 1,108 1,140 1,155 4.538}
{0 CHEMBL377360,1 1,2 1,3 1,4 1,29 1,46 1,55 1,56 1,87 1,88 1,107 1,108 1,118 1,139 1,140 1,141 1,150 1,151 1,155 4}
{0 CHEMBL381633,1 1,2 1,4 1,5 1,57 1,71 1,88 1,99 1,107 1,108 1,118 1,140 1,155 4}
{0 CHEMBL409618,1 1,2 1,3 1,4 1,29 1,46 1,55 1,56 1,87 1,88 1,107 1,108 1,118 1,139 1,140 1,141 1,150 1,151 1,155 4}
{0 CHEMBL427374,1 1,2 1,4 1,5 1,57 1,71 1,88 1,99 1,107 1,108 1,118 1,140 1,155 4}
{0 CHEMBL439324,1 1,2 1,3 1,4 1,38 1,55 1,57 1,88 1,107 1,108 1,118 1,140 1,142 1,150 1,151 1,155 4}
{0 CHEMBL441861,4 1,39 1,61 1,67 1,107 1,108 1,140 1,155 5.172}
{0 CHEMBL455453,4 1,39 1,91 1,107 1,108 1,116 1,140 1,150 1,155 4.208}
{0 CHEMBL455469,4 1,39 1,91 1,107 1,108 1,116 1,140 1,150 1,155 4.443}
{0 CHEMBL484145,4 1,39 1,61 1,67 1,107 1,108 1,140 1,150 1,155 4.509}
{0 CHEMBL487051,4 1,39 1,107 1,108 1,140 1,155 4.297}
{0 CHEMBL50626,4 1,140 1,155 4.553}
{0 CHEMBL519069,4 1,39 1,67 1,73 1,107 1,108 1,140 1,150 1,155 4.301}
{0 CHEMBL520906,4 1,39 1,67 1,107 1,108 1,137 1,140 1,143 1,155 4.27}
