{
  "data_features": {
    "feature": [
      {
        "data_type": "nominal",
        "index": "0",
        "is_ignore": "false",
        "is_row_identifier": "true",
        "is_target": "false",
        "name": "molecule_id",
        "nominal_value": [
          "CHEMBL10",
          "CHEMBL101253",
          "CHEMBL103667",
          "CHEMBL105442",
          "CHEMBL1084546",
          "CHEMBL1090356",
          "CHEMBL1090360",
          "CHEMBL116070",
          "CHEMBL1164265",
          "CHEMBL1173655",
          "CHEMBL117697",
          "CHEMBL119385",
          "CHEMBL1230020",
          "CHEMBL1230122",
          "CHEMBL1236107",
          "CHEMBL1240703",
          "CHEMBL1241674",
          "CHEMBL1242373",
          "CHEMBL124660",
          "CHEMBL1287853",
          "CHEMBL1289926",
          "CHEMBL1336",
          "CHEMBL1375418",
          "CHEMBL1375640",
          "CHEMBL1421",
          "CHEMBL14762",
          "CHEMBL1516890",
          "CHEMBL1614701",
          "CHEMBL1614705",
          "CHEMBL162",
          "CHEMBL1682540",
          "CHEMBL1682545",
          "CHEMBL1682546",
          "CHEMBL1682552",
          "CHEMBL1682553",
          "CHEMBL1682558",
          "CHEMBL1684800",
          "CHEMBL1721885",
          "CHEMBL17370",
          "CHEMBL1738758",
          "CHEMBL1765781",
          "CHEMBL1789941",
          "CHEMBL180022",
          "CHEMBL1825138",
          "CHEMBL1834657",
          "CHEMBL183844",
          "CHEMBL184847",
          "CHEMBL185569",
          "CHEMBL1908391",
          "CHEMBL1908392",
          "CHEMBL1908393",
          "CHEMBL1908394",
          "CHEMBL1908395",
          "CHEMBL1908396",
          "CHEMBL1908397",
          "CHEMBL191003",
          "CHEMBL1929238",
          "CHEMBL1958401",
          "CHEMBL196363",
          "CHEMBL1964290",
          "CHEMBL1964444",
          "CHEMBL1964644",
          "CHEMBL1964687",
          "CHEMBL1964692",
          "CHEMBL1964804",
          "CHEMBL1964937",
          "CHEMBL1965131",
          "CHEMBL1965423",
          "CHEMBL1965507",
          "CHEMBL1965570",
          "CHEMBL1965589",
          "CHEMBL1965660",
          "CHEMBL1965836",
          "CHEMBL1965845",
          "CHEMBL1966279",
          "CHEMBL1966343",
          "CHEMBL1966628",
          "CHEMBL1966703",
          "CHEMBL1966722",
          "CHEMBL1966808",
          "CHEMBL1966816",
          "CHEMBL1966842",
          "CHEMBL1967094",
          "CHEMBL1967302",
          "CHEMBL1967531",
          "CHEMBL1967544",
          "CHEMBL1967560",
          "CHEMBL1967564",
          "CHEMBL1967720",
          "CHEMBL1967878",
          "CHEMBL1967887",
          "CHEMBL1968127",
          "CHEMBL1968151",
          "CHEMBL1968380",
          "CHEMBL1968406",
          "CHEMBL1968590",
          "CHEMBL1968791",
          "CHEMBL1969042",
          "CHEMBL1969049",
          "CHEMBL1969126",
          "CHEMBL1969190",
          "CHEMBL1969301",
          "CHEMBL1969372",
          "CHEMBL1969483",
          "CHEMBL1969502",
          "CHEMBL1969506",
          "CHEMBL1969537",
          "CHEMBL1969561",
          "CHEMBL1969664",
          "CHEMBL1969735",
          "CHEMBL1969755",
          "CHEMBL1969843",
          "CHEMBL1969879",
          "CHEMBL1970104",
          "CHEMBL1970142",
          "CHEMBL1970189",
          "CHEMBL1970203",
          "CHEMBL1970217",
          "CHEMBL1970300",
          "CHEMBL1970314",
          "CHEMBL1970340",
          "CHEMBL1970522",
          "CHEMBL1970709",
          "CHEMBL1970806",
          "CHEMBL1970873",
          "CHEMBL1970903",
          "CHEMBL1970913",
          "CHEMBL1971021",
          "CHEMBL1971141",
          "CHEMBL1971149",
          "CHEMBL1971186",
          "CHEMBL1971245",
          "CHEMBL1971430",
          "CHEMBL1971649",
          "CHEMBL1971694",
          "CHEMBL1971943",
          "CHEMBL1972119",
          "CHEMBL1972125",
          "CHEMBL1972142",
          "CHEMBL1972158",
          "CHEMBL1972221",
          "CHEMBL1972346",
          "CHEMBL1972489",
          "CHEMBL1972576",
          "CHEMBL1972584",
          "CHEMBL1972659",
          "CHEMBL1972849",
          "CHEMBL1972937",
          "CHEMBL1973098",
          "CHEMBL1973142",
          "CHEMBL1973145",
          "CHEMBL1973211",
          "CHEMBL1973483",
          "CHEMBL1973540",
          "CHEMBL1973808",
          "CHEMBL1973860",
          "CHEMBL1973893",
          "CHEMBL1973937",
          "CHEMBL1973961",
          "CHEMBL1974254",
          "CHEMBL1974288",
          "CHEMBL1974310",
          "CHEMBL1974328",
          "CHEMBL1974416",
          "CHEMBL1974664",
          "CHEMBL1974702",
          "CHEMBL1974870",
          "CHEMBL1974935",
          "CHEMBL1975121",
          "CHEMBL1975128",
          "CHEMBL1975138",
          "CHEMBL1975233",
          "CHEMBL1975256",
          "CHEMBL1975500",
          "CHEMBL1975534",
          "CHEMBL1975647",
          "CHEMBL1975900",
          "CHEMBL1976040",
          "CHEMBL1976090",
          "CHEMBL1976093",
          "CHEMBL1976134",
          "CHEMBL1976220",
          "CHEMBL1976240",
          "CHEMBL1976455",
          "CHEMBL1976732",
          "CHEMBL1977135",
          "CHEMBL1977148",
          "CHEMBL1977346",
          "CHEMBL1977681",
          "CHEMBL1978014",
          "CHEMBL1978099",
          "CHEMBL1978166",
          "CHEMBL1978200",
          "CHEMBL1978267",
          "CHEMBL1978448",
          "CHEMBL1979057",
          "CHEMBL1979093",
          "CHEMBL1979176",
          "CHEMBL1979252",
          "CHEMBL1979318",
          "CHEMBL1979357",
          "CHEMBL1979516",
          "CHEMBL1979883",
          "CHEMBL1980142",
          "CHEMBL1980144",
          "CHEMBL1980163",
          "CHEMBL1980297",
          "CHEMBL1980391",
          "CHEMBL1980489",
          "CHEMBL1980540",
          "CHEMBL1980704",
          "CHEMBL1980896",
          "CHEMBL1980995",
          "CHEMBL1981047",
          "CHEMBL1981079",
          "CHEMBL1981410",
          "CHEMBL1981720",
          "CHEMBL1981725",
          "CHEMBL1981782",
          "CHEMBL1982122",
          "CHEMBL1982135",
          "CHEMBL1982361",
          "CHEMBL1982383",
          "CHEMBL1982466",
          "CHEMBL1982506",
          "CHEMBL1982563",
          "CHEMBL1982610",
          "CHEMBL1982660",
          "CHEMBL1982711",
          "CHEMBL1982753",
          "CHEMBL1982866",
          "CHEMBL1982874",
          "CHEMBL1982924",
          "CHEMBL1982957",
          "CHEMBL1982992",
          "CHEMBL1983111",
          "CHEMBL1983449",
          "CHEMBL1983534",
          "CHEMBL1983923",
          "CHEMBL1983932",
          "CHEMBL1983945",
          "CHEMBL1983963",
          "CHEMBL1984038",
          "CHEMBL1984162",
          "CHEMBL1984191",
          "CHEMBL1984363",
          "CHEMBL1984367",
          "CHEMBL1984586",
          "CHEMBL1984633",
          "CHEMBL1984700",
          "CHEMBL1985074",
          "CHEMBL1985092",
          "CHEMBL1985095",
          "CHEMBL1985406",
          "CHEMBL1986139",
          "CHEMBL1986186",
          "CHEMBL1986263",
          "CHEMBL1986328",
          "CHEMBL1986499",
          "CHEMBL1986530",
          "CHEMBL1986781",
          "CHEMBL1986869",
          "CHEMBL1986943",
          "CHEMBL1986970",
          "CHEMBL1987007",
          "CHEMBL1987009",
          "CHEMBL1987034",
          "CHEMBL1987679",
          "CHEMBL1987910",
          "CHEMBL1988075",
          "CHEMBL1988076",
          "CHEMBL1988153",
          "CHEMBL1988163",
          "CHEMBL1988173",
          "CHEMBL1988300",
          "CHEMBL1988387",
          "CHEMBL1988537",
          "CHEMBL1988594",
          "CHEMBL1988608",
          "CHEMBL1988717",
          "CHEMBL1988838",
          "CHEMBL1989029",
          "CHEMBL1989474",
          "CHEMBL1989518",
          "CHEMBL1989708",
          "CHEMBL1989805",
          "CHEMBL1990254",
          "CHEMBL1990288",
          "CHEMBL1990482",
          "CHEMBL1990496",
          "CHEMBL1990821",
          "CHEMBL1990884",
          "CHEMBL1990885",
          "CHEMBL1990904",
          "CHEMBL1990912",
          "CHEMBL1991063",
          "CHEMBL1991138",
          "CHEMBL1991188",
          "CHEMBL1991285",
          "CHEMBL1991356",
          "CHEMBL1991395",
          "CHEMBL1991429",
          "CHEMBL1991434",
          "CHEMBL1991674",
          "CHEMBL1991678",
          "CHEMBL1991725",
          "CHEMBL1992306",
          "CHEMBL1992323",
          "CHEMBL1992342",
          "CHEMBL1992536",
          "CHEMBL1992634",
          "CHEMBL1993243",
          "CHEMBL1993424",
          "CHEMBL1993548",
          "CHEMBL1993584",
          "CHEMBL1993661",
          "CHEMBL1993781",
          "CHEMBL1993941",
          "CHEMBL1994040",
          "CHEMBL1994074",
          "CHEMBL1994538",
          "CHEMBL1994693",
          "CHEMBL1994830",
          "CHEMBL1994864",
          "CHEMBL1994938",
          "CHEMBL1995172",
          "CHEMBL1995740",
          "CHEMBL1995813",
          "CHEMBL1995832",
          "CHEMBL1996048",
          "CHEMBL1996066",
          "CHEMBL1996111",
          "CHEMBL1996234",
          "CHEMBL1996500",
          "CHEMBL1996587",
          "CHEMBL1996791",
          "CHEMBL1996817",
          "CHEMBL1996831",
          "CHEMBL1996931",
          "CHEMBL1996979",
          "CHEMBL1997023",
          "CHEMBL1997051",
          "CHEMBL1997340",
          "CHEMBL1997534",
          "CHEMBL1997597",
          "CHEMBL1997617",
          "CHEMBL1997764",
          "CHEMBL1997846",
          "CHEMBL1997872",
          "CHEMBL1997909",
          "CHEMBL1997924",
          "CHEMBL1998112",
          "CHEMBL1998121",
          "CHEMBL1998159",
          "CHEMBL1998414",
          "CHEMBL1998545",
          "CHEMBL1998585",
          "CHEMBL1998611",
          "CHEMBL1998829",
          "CHEMBL1998953",
          "CHEMBL1999112",
          "CHEMBL1999428",
          "CHEMBL1999496",
          "CHEMBL1999590",
          "CHEMBL1999714",
          "CHEMBL1999811",
          "CHEMBL1999931",
          "CHEMBL2000071",
          "CHEMBL2000078",
          "CHEMBL2000114",
          "CHEMBL2000335",
          "CHEMBL2000354",
          "CHEMBL2000393",
          "CHEMBL2000408",
          "CHEMBL2000429",
          "CHEMBL2000481",
          "CHEMBL2000508",
          "CHEMBL2000568",
          "CHEMBL2000801",
          "CHEMBL2000832",
          "CHEMBL2000894",
          "CHEMBL2001224",
          "CHEMBL2001228",
          "CHEMBL2001239",
          "CHEMBL2001257",
          "CHEMBL2001288",
          "CHEMBL2001485",
          "CHEMBL2001547",
          "CHEMBL2001751",
          "CHEMBL2001920",
          "CHEMBL2001957",
          "CHEMBL2002165",
          "CHEMBL2002240",
          "CHEMBL2002373",
          "CHEMBL2002649",
          "CHEMBL2002702",
          "CHEMBL2002726",
          "CHEMBL2002992",
          "CHEMBL2003271",
          "CHEMBL2003286",
          "CHEMBL2003341",
          "CHEMBL2003456",
          "CHEMBL2003482",
          "CHEMBL2003817",
          "CHEMBL2004290",
          "CHEMBL2004311",
          "CHEMBL2004419",
          "CHEMBL2004447",
          "CHEMBL2004544",
          "CHEMBL2004615",
          "CHEMBL2004871",
          "CHEMBL2004872",
          "CHEMBL2004892",
          "CHEMBL2004934",
          "CHEMBL2005186",
          "CHEMBL2005375",
          "CHEMBL2005475",
          "CHEMBL2005482",
          "CHEMBL2005528",
          "CHEMBL2005828",
          "CHEMBL2005886",
          "CHEMBL2005899",
          "CHEMBL2005936",
          "CHEMBL2006188",
          "CHEMBL2006237",
          "CHEMBL2006263",
          "CHEMBL2006276",
          "CHEMBL2006439",
          "CHEMBL2006493",
          "CHEMBL2006715",
          "CHEMBL2006785",
          "CHEMBL2007002",
          "CHEMBL2007064",
          "CHEMBL2007296",
          "CHEMBL2007592",
          "CHEMBL207400",
          "CHEMBL208637",
          "CHEMBL210887",
          "CHEMBL210928",
          "CHEMBL210963",
          "CHEMBL211378",
          "CHEMBL213505",
          "CHEMBL215152",
          "CHEMBL2178804",
          "CHEMBL220057",
          "CHEMBL220241",
          "CHEMBL221959",
          "CHEMBL223360",
          "CHEMBL225519",
          "CHEMBL226403",
          "CHEMBL230011",
          "CHEMBL2309006",
          "CHEMBL2309609",
          "CHEMBL231209",
          "CHEMBL2333365",
          "CHEMBL234085",
          "CHEMBL243088",
          "CHEMBL244378",
          "CHEMBL246970",
          "CHEMBL24828",
          "CHEMBL249697",
          "CHEMBL253969",
          "CHEMBL255863",
          "CHEMBL256835",
          "CHEMBL259084",
          "CHEMBL259922",
          "CHEMBL260135",
          "CHEMBL261849",
          "CHEMBL262433",
          "CHEMBL271381",
          "CHEMBL272453",
          "CHEMBL278041",
          "CHEMBL288441",
          "CHEMBL296468",
          "CHEMBL300138",
          "CHEMBL306380",
          "CHEMBL316264",
          "CHEMBL31965",
          "CHEMBL340384",
          "CHEMBL340921",
          "CHEMBL363648",
          "CHEMBL371206",
          "CHEMBL377300",
          "CHEMBL377383",
          "CHEMBL377408",
          "CHEMBL378627",
          "CHEMBL379218",
          "CHEMBL379835",
          "CHEMBL384304",
          "CHEMBL386051",
          "CHEMBL387971",
          "CHEMBL392642",
          "CHEMBL394619",
          "CHEMBL394790",
          "CHEMBL396523",
          "CHEMBL402846",
          "CHEMBL404367",
          "CHEMBL406845",
          "CHEMBL411903",
          "CHEMBL415049",
          "CHEMBL41783",
          "CHEMBL422897",
          "CHEMBL424872",
          "CHEMBL428690",
          "CHEMBL440084",
          "CHEMBL445813",
          "CHEMBL450786",
          "CHEMBL458997",
          "CHEMBL461876",
          "CHEMBL464552",
          "CHEMBL468280",
          "CHEMBL475251",
          "CHEMBL477772",
          "CHEMBL481491",
          "CHEMBL482767",
          "CHEMBL482967",
          "CHEMBL483158",
          "CHEMBL483321",
          "CHEMBL484390",
          "CHEMBL491473",
          "CHEMBL491758",
          "CHEMBL494089",
          "CHEMBL497151",
          "CHEMBL508928",
          "CHEMBL509032",
          "CHEMBL513909",
          "CHEMBL514409",
          "CHEMBL519697",
          "CHEMBL521851",
          "CHEMBL522892",
          "CHEMBL52387",
          "CHEMBL525191",
          "CHEMBL526133",
          "CHEMBL535",
          "CHEMBL539474",
          "CHEMBL553",
          "CHEMBL554",
          "CHEMBL558752",
          "CHEMBL560733",
          "CHEMBL560813",
          "CHEMBL565612",
          "CHEMBL572878",
          "CHEMBL572881",
          "CHEMBL573339",
          "CHEMBL574738",
          "CHEMBL575265",
          "CHEMBL576982",
          "CHEMBL583144",
          "CHEMBL592030",
          "CHEMBL601719",
          "CHEMBL607707",
          "CHEMBL608154",
          "CHEMBL91829",
          "CHEMBL939",
          "CHEMBL941",
          "CHEMBL95692"
        ],
        "number_of_missing_values": "0"
      },
      {
        "data_type": "numeric",
        "index": "1",
        "is_ignore": "false",
        "is_row_identifier": "false",
        "is_target": "false",
        "name": "FCFP4_1024b635",
        "number_of_missing_values": "0"
      },
      {
        "data_type": "numeric",
        "index": "2",
        "is_ignore": "false",
        "is_row_identifier": "false",
        "is_target": "false",
        "name": "FCFP4_1024b37",
        "number_of_missing_values": "0"
      },
      {
        "data_type": "numeric",
        "index": "3",
        "is_ignore": "false",
        "is_row_identifier": "false",
        "is_target": "false",
        "name": "FCFP4_1024b644",
        "number_of_missing_values": "0"
      },
      {
        "data_type": "numeric",
        "index": "4",
        "is_ignore": "false",
        "is_row_identifier": "false",
        "is_target": "false",
        "name": "FCFP4_1024b858",
        "number_of_missing_values": "0"
      },
      {
        "data_type": "numeric",
        "index": "5",
        "is_ignore": "false",
        "is_row_identifier": "false",
        "is_target": "false",
        "name": "FCFP4_1024b167",
        "number_of_missing_values": "0"
      },
      {
        "data_type": "numeric",
        "index": "6",
        "is_ignore": "false",
        "is_row_identifier": "false",
        "is_target": "false",
        "name": "FCFP4_1024b599",
        "number_of_missing_values": "0"
      },
      {
        "data_type": "numeric",
        "index": "7",
        "is_ignore": "false",
        "is_row_identifier": "false",
        "is_target": "false",
        "name": "FCFP4_1024b177",
        "number_of_missing_values": "0"
      },
      {
        "data_type": "numeric",
        "index": "8",
        "is_ignore": "false",
        "is_row_identifier": "false",
        "is_target": "false",
        "name": "FCFP4_1024b604",
        "number_of_missing_values": "0"
      },
      {
        "data_type": "numeric",
        "index": "9",
        "is_ignore": "false",
        "is_row_identifier": "false",
        "is_target": "false",
        "name": "FCFP4_1024b1",
        "number_of_missing_values": "0"
      },
      {
        "data_type": "numeric",
        "index": "10",
        "is_ignore": "false",
        "is_row_identifier": "false",
        "is_target": "false",
        "name": "FCFP4_1024b10",
        "number_of_missing_values": "0"
      },
      {
        "data_type": "numeric",
        "index": "11",
        "is_ignore": "false",
        "is_row_identifier": "false",
        "is_target": "false",
        "name": "FCFP4_1024b100",
        "number_of_missing_values": "0"
      },
      {
        "data_type": "numeric",
        "index": "12",
        "is_ignore": "false",
        "is_row_identifier": "false",
        "is_target": "false",
        "name": "FCFP4_1024b1000",
        "number_of_missing_values": "0"
      },
      {
        "data_type": "numeric",
        "index": "13",
        "is_ignore": "false",
        "is_row_identifier": "false",
        "is_target": "false",
        "name": "FCFP4_1024b1001",
        "number_of_missing_values": "0"
      },
      {
        "data_type": "numeric",
        "index": "14",
        "is_ignore": "false",
        "is_row_identifier": "false",
        "is_target": "false",
        "name": "FCFP4_1024b1002",
        "number_of_missing_values": "0"
      },
      {
        "data_type": "numeric",
        "index": "15",
        "is_ignore": "false",
        "is_row_identifier": "false",
        "is_target": "false",
        "name": "FCFP4_1024b1003",
        "number_of_missing_values": "0"
      },
      {
        "data_type": "numeric",
        "index": "16",
        "is_ignore": "false",
        "is_row_identifier": "false",
        "is_target": "false",
        "name": "FCFP4_1024b1004",
        "number_of_missing_values": "0"
      },
      {
        "data_type": "numeric",
        "index": "17",
        "is_ignore": "false",
        "is_row_identifier": "false",
        "is_target": "false",
        "name": "FCFP4_1024b1005",
        "number_of_missing_values": "0"
      },
      {
        "data_type": "numeric",
        "index": "18",
        "is_ignore": "false",
        "is_row_identifier": "false",
        "is_target": "false",
        "name": "FCFP4_1024b1006",
        "number_of_missing_values": "0"
      },
      {
        "data_type": "numeric",
        "index": "19",
        "is_ignore": "false",
        "is_row_identifier": "false",
        "is_target": "false",
        "name": "FCFP4_1024b1007",
        "number_of_missing_values": "0"
      },
      {
        "data_type": "numeric",
        "index": "20",
        "is_ignore": "false",
        "is_row_identifier": "false",
        "is_target": "false",
        "name": "FCFP4_1024b1008",
        "number_of_missing_values": "0"
      },
      {
        "data_type": "numeric",
        "index": "21",
        "is_ignore": "false",
        "is_row_identifier": "false",
        "is_target": "false",
        "name": "FCFP4_1024b1009",
        "number_of_missing_values": "0"
      },
      {
        "data_type": "numeric",
        "index": "22",
        "is_ignore": "false",
        "is_row_identifier": "false",
        "is_target": "false",
        "name": "FCFP4_1024b101",
        "number_of_missing_values": "0"
      },
      {
        "data_type": "numeric",
        "index": "23",
        "is_ignore": "false",
        "is_row_identifier": "false",
        "is_target": "false",
        "name": "FCFP4_1024b1010",
        "number_of_missing_values": "0"
      },
      {
        "data_type": "numeric",
        "index": "24",
        "is_ignore": "false",
        "is_row_identifier": "false",
        "is_target": "false",
        "name": "FCFP4_1024b1011",
        "number_of_missing_values": "0"
      },
      {
        "data_type": "numeric",
        "index": "25",
        "is_ignore": "false",
        "is_row_identifier": "false",
        "is_target": "false",
        "name": "FCFP4_1024b1012",
        "number_of_missing_values": "0"
      },
      {
        "data_type": "numeric",
        "index": "26",
        "is_ignore": "false",
        "is_row_identifier": "false",
        "is_target": "false",
        "name": "FCFP4_1024b1013",
        "number_of_missing_values": "0"
      },
      {
        "data_type": "numeric",
        "index": "27",
        "is_ignore": "false",
        "is_row_identifier": "false",
        "is_target": "false",
        "name": "FCFP4_1024b1014",
        "number_of_missing_values": "0"
      },
      {
        "data_type": "numeric",
        "index": "28",
        "is_ignore": "false",
        "is_row_identifier": "false",
        "is_target": "false",
        "name": "FCFP4_1024b1015",
        "number_of_missing_values": "0"
      },
      {
        "data_type": "numeric",
        "index": "29",
        "is_ignore": "false",
        "is_row_identifier": "false",
        "is_target": "false",
        "name": "FCFP4_1024b1016",
        "number_of_missing_values": "0"
      },
      {
        "data_type": "numeric",
        "index": "30",
        "is_ignore": "false",
        "is_row_identifier": "false",
        "is_target": "false",
        "name": "FCFP4_1024b1017",
        "number_of_missing_values": "0"
      },
      {
        "data_type": "numeric",
        "index": "31",
        "is_ignore": "false",
        "is_row_identifier": "false",
        "is_target": "false",
        "name": "FCFP4_1024b1018",
        "number_of_missing_values": "0"
      },
      {
        "data_type": "numeric",
        "index": "32",
        "is_ignore": "false",
        "is_row_identifier": "false",
        "is_target": "false",
        "name": "FCFP4_1024b1019",
        "number_of_missing_values": "0"
      },
      {
        "data_type": "numeric",
        "index": "33",
        "is_ignore": "false",
        "is_row_identifier": "false",
        "is_target": "false",
        "name": "FCFP4_1024b102",
        "number_of_missing_values": "0"
      },
      {
        "data_type": "numeric",
        "index": "34",
        "is_ignore": "false",
        "is_row_identifier": "false",
        "is_target": "false",
        "name": "FCFP4_1024b1020",
        "number_of_missing_values": "0"
      },
      {
        "data_type": "numeric",
        "index": "35",
        "is_ignore": "false",
        "is_row_identifier": "false",
        "is_target": "false",
        "name": "FCFP4_1024b1021",
        "number_of_missing_values": "0"
      },
      {
        "data_type": "numeric",
        "index": "36",
        "is_ignore": "false",
        "is_row_identifier": "false",
        "is_target": "false",
        "name": "FCFP4_1024b1022",
        "number_of_missing_values": "0"
      },
      {
        "data_type": "numeric",
        "index": "37",
        "is_ignore": "false",
        "is_row_identifier": "false",
        "is_target": "false",
        "name": "FCFP4_1024b1023",
        "number_of_missing_values": "0"
      },
      {
        "data_type": "numeric",
        "index": "38",
        "is_ignore": "false",
        "is_row_identifier": "false",
        "is_target": "false",
        "name": "FCFP4_1024b1024",
        "number_of_missing_values": "0"
      },
      {
        "data_type": "numeric",
        "index": "39",
        "is_ignore": "false",
        "is_row_identifier": "false",
        "is_target": "false",
        "name": "FCFP4_1024b103",
        "number_of_missing_values": "0"
      },
      {
        "data_type": "numeric",
        "index": "40",
        "is_ignore": "false",
        "is_row_identifier": "false",
        "is_target": "false",
        "name": "FCFP4_1024b104",
        "number_of_missing_values": "0"
      },
      {
        "data_type": "numeric",
        "index": "41",
        "is_ignore": "false",
        "is_row_identifier": "false",
        "is_target": "false",
        "name": "FCFP4_1024b105",
        "number_of_missing_values": "0"
      },
      {
        "data_type": "numeric",
        "index": "42",
        "is_ignore": "false",
        "is_row_identifier": "false",
        "is_target": "false",
        "name": "FCFP4_1024b106",
        "number_of_missing_values": "0"
      },
      {
        "data_type": "numeric",
        "index": "43",
        "is_ignore": "false",
        "is_row_identifier": "false",
        "is_target": "false",
        "name": "FCFP4_1024b107",
        "number_of_missing_values": "0"
      },
      {
        "data_type": "numeric",
        "index": "44",
        "is_ignore": "false",
        "is_row_identifier": "false",
        "is_target": "false",
        "name": "FCFP4_1024b108",
        "number_of_missing_values": "0"
      },
      {
        "data_type": "numeric",
        "index": "45",
        "is_ignore": "false",
        "is_row_identifier": "false",
        "is_target": "false",
        "name": "FCFP4_1024b109",
        "number_of_missing_values": "0"
      },
      {
        "data_type": "numeric",
        "index": "46",
        "is_ignore": "false",
        "is_row_identifier": "false",
        "is_target": "false",
        "name": "FCFP4_1024b11",
        "number_of_missing_values": "0"
      },
      {
        "data_type": "numeric",
        "index": "47",
        "is_ignore": "false",
        "is_row_identifier": "false",
        "is_target": "false",
        "name": "FCFP4_1024b110",
        "number_of_missing_values": "0"
      },
      {
        "data_type": "numeric",
        "index": "48",
        "is_ignore": "false",
        "is_row_identifier": "false",
        "is_target": "false",
        "name": "FCFP4_1024b111",
        "number_of_missing_values": "0"
      },
      {
        "data_type": "numeric",
        "index": "49",
        "is_ignore": "false",
        "is_row_identifier": "false",
        "is_target": "false",
        "name": "FCFP4_1024b112",
        "number_of_missing_values": "0"
      },
      {
        "data_type": "numeric",
        "index": "50",
        "is_ignore": "false",
        "is_row_identifier": "false",
        "is_target": "false",
        "name": "FCFP4_1024b113",
        "number_of_missing_values": "0"
      },
      {
        "data_type": "numeric",
        "index": "51",
        "is_ignore": "false",
        "is_row_identifier": "false",
        "is_target": "false",
        "name": "FCFP4_1024b114",
        "number_of_missing_values": "0"
      },
      {
        "data_type": "numeric",
        "index": "52",
        "is_ignore": "false",
        "is_row_identifier": "false",
        "is_target": "true",
        "name": "pXC50",
        "number_of_missing_values": "0"
      }
    ]
  }
}