{
  "data_qualities": {
    "quality": [
      {
        "name": "AutoCorrelation",
        "value": "0.5233378378378378"
      },
      {
        "name": "ClassEntropy",
        "value": []
      },
      {
        "name": "Dimensionality",
        "value": "0.6"
      },
      {
        "name": "EquivalentNumberOfAtts",
        "value": []
      },
      {
        "name": "MajorityClassPercentage",
        "value": []
      },
      {
        "name": "MajorityClassSize",
        "value": []
      },
      {
        "name": "MaxAttributeEntropy",
        "value": []
      },
      {
        "name": "MaxKurtosisOfNumericAtts",
        "value": "74.99999999999994"
      },
      {
        "name": "MaxMeansOfNumericAtts",
        "value": "268.7925333333333"
      },
      {
        "name": "MaxMutualInformation",
        "value": []
      },
      {
        "name": "MaxNominalAttDistinctValues",
        "value": []
      },
      {
        "name": "MaxSkewnessOfNumericAtts",
        "value": "8.660254037844384"
      },
      {
        "name": "MaxStdDevOfNumericAtts",
        "value": "109.78295507307396"
      },
      {
        "name": "MeanAttributeEntropy",
        "value": []
      },
      {
        "name": "MeanKurtosisOfNumericAtts",
        "value": "17.031607858164346"
      },
      {
        "name": "MeanMeansOfNumericAtts",
        "value": "16.338520606060605"
      },
      {
        "name": "MeanMutualInformation",
        "value": []
      },
      {
        "name": "MeanNoiseToSignalRatio",
        "value": []
      },
      {
        "name": "MeanNominalAttDistinctValues",
        "value": []
      },
      {
        "name": "MeanSkewnessOfNumericAtts",
        "value": "2.5947631296103113"
      },
      {
        "name": "MeanStdDevOfNumericAtts",
        "value": "6.623673490412717"
      },
      {
        "name": "MinAttributeEntropy",
        "value": []
      },
      {
        "name": "MinKurtosisOfNumericAtts",
        "value": "-0.616877394393267"
      },
      {
        "name": "MinMeansOfNumericAtts",
        "value": "0.0"
      },
      {
        "name": "MinMutualInformation",
        "value": []
      },
      {
        "name": "MinNominalAttDistinctValues",
        "value": []
      },
      {
        "name": "MinSkewnessOfNumericAtts",
        "value": "-3.759333645092572"
      },
      {
        "name": "MinStdDevOfNumericAtts",
        "value": "0.0"
      },
      {
        "name": "MinorityClassPercentage",
        "value": []
      },
      {
        "name": "MinorityClassSize",
        "value": []
      },
      {
        "name": "NumberOfBinaryFeatures",
        "value": "0.0"
      },
      {
        "name": "NumberOfClasses",
        "value": "0.0"
      },
      {
        "name": "NumberOfFeatures",
        "value": "45.0"
      },
      {
        "name": "NumberOfInstances",
        "value": "75.0"
      },
      {
        "name": "NumberOfInstancesWithMissingValues",
        "value": "0.0"
      },
      {
        "name": "NumberOfMissingValues",
        "value": "0.0"
      },
      {
        "name": "NumberOfNumericFeatures",
        "value": "44.0"
      },
      {
        "name": "NumberOfSymbolicFeatures",
        "value": "1.0"
      },
      {
        "name": "PercentageOfBinaryFeatures",
        "value": "0.0"
      },
      {
        "name": "PercentageOfInstancesWithMissingValues",
        "value": "0.0"
      },
      {
        "name": "PercentageOfMissingValues",
        "value": "0.0"
      },
      {
        "name": "PercentageOfNumericFeatures",
        "value": "97.77777777777777"
      },
      {
        "name": "PercentageOfSymbolicFeatures",
        "value": "2.2222222222222223"
      },
      {
        "name": "Quartile1AttributeEntropy",
        "value": []
      },
      {
        "name": "Quartile1KurtosisOfNumericAtts",
        "value": "2.3535830749962026"
      },
      {
        "name": "Quartile1MeansOfNumericAtts",
        "value": "0.41619"
      },
      {
        "name": "Quartile1MutualInformation",
        "value": []
      },
      {
        "name": "Quartile1SkewnessOfNumericAtts",
        "value": "1.1506797628486314"
      },
      {
        "name": "Quartile1StdDevOfNumericAtts",
        "value": "0.2781555161532141"
      },
      {
        "name": "Quartile2AttributeEntropy",
        "value": []
      },
      {
        "name": "Quartile2KurtosisOfNumericAtts",
        "value": "3.157000166928492"
      },
      {
        "name": "Quartile2MeansOfNumericAtts",
        "value": "3.38"
      },
      {
        "name": "Quartile2MutualInformation",
        "value": []
      },
      {
        "name": "Quartile2SkewnessOfNumericAtts",
        "value": "1.5268316248318081"
      },
      {
        "name": "Quartile2StdDevOfNumericAtts",
        "value": "2.4706461478781034"
      },
      {
        "name": "Quartile3AttributeEntropy",
        "value": []
      },
      {
        "name": "Quartile3KurtosisOfNumericAtts",
        "value": "29.166271204184227"
      },
      {
        "name": "Quartile3MeansOfNumericAtts",
        "value": "20.023333333333333"
      },
      {
        "name": "Quartile3MutualInformation",
        "value": []
      },
      {
        "name": "Quartile3SkewnessOfNumericAtts",
        "value": "5.080468162050696"
      },
      {
        "name": "Quartile3StdDevOfNumericAtts",
        "value": "7.75304957947159"
      },
      {
        "name": "StdvNominalAttDistinctValues",
        "value": []
      }
    ]
  }
}