"molecule_id","Mi","Sp","Sv","AMW","pXC50"
{1 1.142,2 31.551,3 29.794,4 7.45,5 4.854}
{0 CHEMBL1923954,1 1.128,2 36.375,3 33.938,4 7.225,5 8}
{0 CHEMBL1923955,1 1.118,2 38.614,3 36.411,4 7.695,5 7.854}
{0 CHEMBL1923956,1 1.131,2 33.79,3 32.267,4 7.971,5 7.569}
{0 CHEMBL1923957,1 1.13,2 36.796,3 35.289,4 8.101,5 7.638}
{0 CHEMBL1923958,1 1.142,2 26.267,3 25.214,4 8.059,5 6.201}
{0 CHEMBL1923959,1 1.134,2 32.472,3 30.238,4 7.779,5 7.509}
{0 CHEMBL1923960,1 1.123,2 34.71,3 32.711,4 8.294,5 7.854}
{0 CHEMBL1923961,1 1.123,2 37.716,3 35.733,4 8.4,5 7.886}
{0 CHEMBL1923962,1 1.135,2 33.375,3 30.938,4 6.954,5 7.553}
{0 CHEMBL1923963,1 1.125,2 35.614,3 33.411,4 7.455,5 7.745}
{0 CHEMBL1923964,1 1.147,2 25.853,3 23.884,4 6.801,5 6.081}
{0 CHEMBL1923965,1 1.142,2 31.551,3 29.794,4 7.45,5 6.886}
{0 CHEMBL1923966,1 1.141,2 33.313,3 31.321,4 7.293,5 6.585}
{0 CHEMBL1923967,1 1.141,2 33.313,3 31.321,4 7.293,5 4.678}
{0 CHEMBL1923968,1 1.142,2 31.551,3 29.794,4 7.45,5 4.377}
{0 CHEMBL288365,1 1.142,2 31.551,3 29.794,4 7.45,5 8.125}
