"molecule_id","AMW","C.","H.","Me","Mi","Mp","Mv","MW","N.","nAB","nAT","pXC50"
{1 7.056,2 39.5,3 48.8,4 1.006,5 1.128,6 0.638,7 0.608,8 303.39,9 2.3,10 6,11 43,12 9.387}
{0 CHEMBL12980,1 7.03,2 43.8,3 47.9,4 0.996,5 1.119,6 0.661,7 0.624,8 337.45,9 2.1,10 12,11 48,12 9.658}
{0 CHEMBL167932,1 7.741,2 33.3,3 51.5,4 0.989,5 1.129,6 0.686,7 0.61,8 255.45,9 9.1,10 5,11 33,12 7.638}
{0 CHEMBL1788199,1 7.03,2 43.8,3 47.9,4 0.996,5 1.119,6 0.661,7 0.624,8 337.45,9 2.1,10 12,11 48,12 9.244}
{0 CHEMBL1788286,1 7.292,2 45.7,3 45.7,4 0.998,5 1.115,6 0.674,7 0.64,8 335.43,9 2.2,10 12,11 46,12 8.287}
{0 CHEMBL2112938,1 8.647,2 33.3,3 46.7,4 1.009,5 1.139,6 0.694,7 0.633,8 259.41,9 10,10 5,11 30,12 7.602}
{0 CHEMBL2112939,1 8.286,2 33.3,3 48.5,4 1.005,5 1.139,6 0.684,7 0.621,8 273.44,9 9.1,10 5,11 33,12 8.131}
{0 CHEMBL2112940,1 7.731,2 33.3,3 51.3,4 0.998,5 1.139,6 0.669,7 0.604,8 301.5,9 7.7,10 5,11 39,12 8.638}
{0 CHEMBL2114395,1 6.717,2 39,3 51.2,4 0.998,5 1.129,6 0.634,7 0.596,8 275.38,9 2.4,10 6,11 41,12 6.807}
{0 CHEMBL2114396,1 6.717,2 39,3 51.2,4 0.998,5 1.129,6 0.634,7 0.596,8 275.38,9 2.4,10 6,11 41,12 7.721}
{0 CHEMBL2115341,1 6.717,2 39,3 51.2,4 0.998,5 1.129,6 0.634,7 0.596,8 275.38,9 2.4,10 6,11 41,12 8.538}
{0 CHEMBL2115342,1 6.717,2 39,3 51.2,4 0.998,5 1.129,6 0.634,7 0.596,8 275.38,9 2.4,10 6,11 41,12 9.538}
{0 CHEMBL21812,1 6.182,2 37.9,3 55.2,4 0.988,5 1.13,6 0.624,7 0.575,8 358.55,9 1.7,10 6,11 58,12 11}
{0 CHEMBL21905,1 6.08,2 36.8,3 56.1,4 0.987,5 1.133,6 0.617,7 0.567,8 346.54,9 1.8,10 6,11 57,12 10.699}
{0 CHEMBL26505,1 6.382,2 41.2,3 52.9,4 0.985,5 1.124,6 0.643,7 0.594,8 325.49,9 2,10 12,11 51,12 7.292}
{0 CHEMBL288482,1 6.803,2 38.1,3 50.8,4 1.001,5 1.131,6 0.63,7 0.596,8 428.58,9 3.2,10 12,11 63,12 5.469}
{0 CHEMBL296633,1 7.102,2 42.6,3 48.1,4 1.002,5 1.127,6 0.652,7 0.618,8 383.5,9 1.9,10 12,11 54,12 9.585}
{0 CHEMBL296895,1 6.974,2 42.1,3 49.1,4 0.999,5 1.128,6 0.649,7 0.613,8 397.53,9 1.8,10 12,11 57,12 9.699}
{0 CHEMBL297276,1 7.245,2 43.1,3 47.1,4 1.004,5 1.126,6 0.656,7 0.625,8 369.47,9 2,10 12,11 51,12 7.747}
{0 CHEMBL297683,1 9.653,2 43.8,3 45.8,4 0.997,5 1.113,6 0.717,7 0.652,8 463.34,9 2.1,10 12,11 48,12 8.337}
{0 CHEMBL298085,1 9.653,2 43.8,3 45.8,4 0.997,5 1.113,6 0.717,7 0.652,8 463.34,9 2.1,10 12,11 48,12 9.469}
{0 CHEMBL350332,1 7.269,2 33.3,3 53.8,4 0.985,5 1.13,6 0.671,7 0.594,8 283.51,9 7.7,10 5,11 39,12 7.444}
{0 CHEMBL36583,1 6.755,2 39,3 50.8,4 0.998,5 1.13,6 0.635,7 0.598,8 398.55,9 3.4,10 12,11 59,12 7.585}
{0 CHEMBL37372,1 6.567,2 40.4,3 51.9,4 0.992,5 1.125,6 0.64,7 0.596,8 341.49,9 1.9,10 12,11 52,12 7}
{0 CHEMBL39342,1 6.745,2 39.6,3 50.9,4 0.998,5 1.127,6 0.636,7 0.599,8 357.49,9 1.9,10 12,11 53,12 5.678}
{0 CHEMBL416974,1 6.655,2 38.7,3 51.6,4 0.996,5 1.13,6 0.633,7 0.594,8 412.58,9 3.2,10 12,11 62,12 6.824}
{0 CHEMBL47650,1 7.245,2 43.1,3 47.1,4 1.004,5 1.126,6 0.656,7 0.625,8 369.47,9 2,10 12,11 51,12 8.26}
{0 CHEMBL49576,1 7.102,2 42.6,3 48.1,4 1.002,5 1.127,6 0.652,7 0.618,8 383.5,9 1.9,10 12,11 54,12 9.076}
{0 CHEMBL517712,1 6.577,2 38.6,3 52.3,4 0.996,5 1.129,6 0.631,7 0.59,8 289.41,9 2.3,10 6,11 44,12 8.62}
{0 CHEMBL549577,1 7.292,2 45.7,3 45.7,4 0.998,5 1.115,6 0.674,7 0.64,8 335.43,9 2.2,10 12,11 46,12 9.699}
{0 CHEMBL558910,1 7.03,2 43.8,3 47.9,4 0.996,5 1.119,6 0.661,7 0.624,8 337.45,9 2.1,10 12,11 48,12 9.721}
{0 CHEMBL9967,1 7.478,2 40.4,3 44.7,4 1.005,5 1.133,6 0.66,7 0.633,8 351.45,9 10.6,10 12,11 47,12 6.77}
