"molecule_id","AMW","C.","H.","Me","Mi","Mp","Mv","MW","N.","nAB","nAT","nB","nBM","nBO","nBR","nBT","nC","nCL","nCsp","nCsp2","nCsp3","nDB","nF","nH","nHet","nHM","nI","nN","nO","nP","nS","nSK","nTB","nX","O.","RBF","RBN","SCBO","Se","Si","Sp","Sv","X.","pXC50"
{1 7.581,2 39.3,3 44.6,4 1.011,5 1.141,6 0.652,7 0.629,8 424.53,9 10.7,10 11,11 56,13 14,14 34,16 59,17 22,19 1,20 12,21 9,22 2,23 1,24 25,25 9,28 6,29 2,32 31,33 1,34 1,35 3.6,36 0.051,37 3,38 43.5,39 56.614,40 63.9,41 36.495,42 35.209,43 1.8,44 4.301}
{0 CHEMBL309216,1 6.441,2 29.4,3 54.9,4 1.006,5 1.153,6 0.588,7 0.554,8 328.47,9 7.8,11 51,13 3,14 23,16 51,17 15,20 3,21 12,22 3,24 28,25 8,28 4,29 4,32 23,35 7.8,36 0.137,37 7,38 26,39 51.32,40 58.813,41 29.978,42 28.266,44 6.503}
{0 CHEMBL309274,1 6.441,2 29.4,3 54.9,4 1.006,5 1.153,6 0.588,7 0.554,8 328.47,9 7.8,11 51,13 3,14 23,16 51,17 15,20 3,21 12,22 3,24 28,25 8,28 4,29 4,32 23,35 7.8,36 0.137,37 7,38 26,39 51.32,40 58.813,41 29.978,42 28.266,44 4.147}
{0 CHEMBL311875,1 6.964,2 34.8,3 50,4 1.008,5 1.142,6 0.621,7 0.592,8 459.61,9 7.6,10 6,11 66,13 10,14 35,16 68,17 23,20 10,21 13,22 4,24 33,25 10,28 5,29 5,32 33,35 7.6,36 0.118,37 8,38 42,39 66.516,40 75.351,41 40.961,42 39.056,44 5.377}
{0 CHEMBL311925,1 6.949,2 36,3 50,4 1.007,5 1.138,6 0.624,7 0.594,8 347.46,9 6,10 6,11 50,13 9,14 26,16 51,17 18,20 9,21 9,22 3,24 25,25 7,28 3,29 4,32 25,35 8,36 0.157,37 8,38 32,39 50.334,40 56.9,41 31.211,42 29.718,44 5.331}
{0 CHEMBL420207,1 6.441,2 29.4,3 54.9,4 1.006,5 1.153,6 0.588,7 0.554,8 328.47,9 7.8,11 51,13 3,14 23,16 51,17 15,20 3,21 12,22 3,24 28,25 8,28 4,29 4,32 23,35 7.8,36 0.137,37 7,38 26,39 51.32,40 58.813,41 29.978,42 28.266,44 6.762}
{0 CHEMBL78505,1 7.286,2 33.3,3 49.4,4 1.011,5 1.142,6 0.627,7 0.596,8 633.86,9 8,10 6,11 87,13 12,14 46,16 89,17 29,20 12,21 17,22 6,24 43,25 15,26 1,28 7,29 7,31 1,32 44,35 8,36 0.146,37 13,38 55,39 87.985,40 99.348,41 54.574,42 51.823,44 5.511}
{0 CHEMBL78699,1 6.938,2 35.7,3 50,4 1.006,5 1.14,6 0.625,7 0.594,8 388.52,9 7.1,10 6,11 56,13 9,14 30,16 58,17 20,20 9,21 11,22 3,24 28,25 8,28 4,29 4,32 28,35 7.1,36 0.103,37 6,38 36,39 56.32,40 63.813,41 34.978,42 33.266,44 4.077}
{0 CHEMBL79083,1 7.124,2 31.8,3 52.3,4 1.005,5 1.141,6 0.628,7 0.583,8 313.47,9 6.8,11 44,13 3,14 22,16 45,17 14,20 3,21 11,22 3,24 23,25 7,26 1,28 3,29 3,31 1,32 21,35 6.8,36 0.089,37 4,38 25,39 44.2,40 50.195,41 27.642,42 25.664,44 4.712}
{0 CHEMBL79092,1 7.463,2 34.4,3 48.4,4 1.011,5 1.138,6 0.638,7 0.605,8 477.65,9 7.8,10 6,11 64,13 10,14 35,16 66,17 22,20 10,21 12,22 4,24 31,25 11,26 1,28 5,29 5,31 1,32 33,35 7.8,36 0.121,37 8,38 42,39 64.709,40 72.856,41 40.847,42 38.716,44 4.852}
{0 CHEMBL80368,1 6.95,2 31.4,3 51,4 1.015,5 1.149,6 0.601,7 0.578,8 354.46,9 7.8,11 51,13 4,14 26,16 52,17 16,20 4,21 12,22 4,24 26,25 9,28 4,29 5,32 25,35 9.8,36 0.096,37 5,38 30,39 51.763,40 58.607,41 30.671,42 29.454,44 4.499}
{0 CHEMBL81423,1 6.441,2 29.4,3 54.9,4 1.006,5 1.153,6 0.588,7 0.554,8 328.47,9 7.8,11 51,13 3,14 23,16 51,17 15,20 3,21 12,22 3,24 28,25 8,28 4,29 4,32 23,35 7.8,36 0.137,37 7,38 26,39 51.32,40 58.813,41 29.978,42 28.266,44 4.516}
