{
  "data_set_description": {
    "collection_date": "November 2013",
    "creator": "Dr Jeremy Besnard, Dr Ivan Olier, Dr Noureddin Sadawi, Dr Larisa Soldatova, Dr Crina Grosan, Prof Ross King, Dr Richard Bickerton, Prof Andrew Hopkins and Dr Willem van Hoorn",
    "default_target_attribute": "pXC50",
    "description": "This dataset contains QSAR data (from ChEMBL version 17) showing activity values (unit is pseudo-pCI50) of several compounds on drug target ChEMBL_ID: CHEMBL1250416 (TID: 103530), and it has 22 rows and 43 features (not including molecule IDs and class feature: molecule_id and pXC50). The features represent Basic Molecular Descriptors which were generated from SMILES strings.  Missing value imputation was applied to this dataset (By choosing the Median).",
    "description_version": "1",
    "file_id": "3421586",
    "format": "ARFF",
    "id": "30508",
    "licence": "Public",
    "md5_checksum": "d2375df9cb55af3ad354cffa5f47b028",
    "minio_url": "https://data.openml.org/datasets/0003/30508/dataset_30508.pq",
    "name": "QSAR-DATASET-FOR-DRUG-TARGET-CHEMBL1250416",
    "original_data_url": "https://www.ebi.ac.uk/chembl/target/inspect/CHEMBL1250416",
    "parquet_url": "https://data.openml.org/datasets/0003/30508/dataset_30508.pq",
    "processing_date": "2018-10-04 01:51:05",
    "row_id_attribute": "molecule_id",
    "status": "deactivated",
    "tag": [
      "MetaQSAR",
      "study_13"
    ],
    "upload_date": "2016-07-15T05:11:00",
    "url": "https://api.openml.org/data/v1/download/3421586/QSAR-DATASET-FOR-DRUG-TARGET-CHEMBL1250416.arff",
    "version": "8",
    "visibility": "public"
  }
}