"molecule_id","SCBO","RBF","nSK","MW","nCsp","nTB","AMW","C.","H.","Me","Mi","Mp","Mv","N.","nAB","nAT","nB","nBM","nBO","nBR","nBT","nC","nCL","nCsp2","nCsp3","nDB","nF","nH","nHet","nHM","pXC50"
{1 51.5,2 0.143,3 35,4 493.5,7 8.364,8 40.7,9 40.7,10 1.016,11 1.126,12 0.688,13 0.659,14 8.5,15 23,16 59,18 24,19 39,21 63,22 24,24 19,25 5,26 1,28 24,29 11,30 1,31 5.959}
{0 CHEMBL10247,1 22,2 0.188,3 17,4 253.35,7 7.917,8 37.5,9 46.9,10 1.011,11 1.124,12 0.667,13 0.626,14 3.1,15 6,16 32,18 8,19 17,21 32,22 12,24 8,25 4,26 2,28 15,29 5,30 1,31 4}
{0 CHEMBL10251,1 55,2 0.136,3 36,4 499.55,7 8.057,8 43.5,9 41.9,10 1.003,11 1.12,12 0.701,13 0.661,14 8.1,15 28,16 62,18 29,19 40,21 66,22 27,24 23,25 4,26 1,28 26,29 9,30 1,31 7.77}
{0 CHEMBL102527,1 43.5,2 0.152,3 33,4 489.72,7 7.652,8 37.5,9 48.4,10 1.002,11 1.125,12 0.669,13 0.62,14 4.7,15 11,16 64,18 14,19 35,21 66,22 24,24 12,25 12,26 3,28 31,29 9,30 2,31 8.009}
{0 CHEMBL102795,1 42.5,2 0.159,3 32,4 475.69,7 7.798,8 37.7,9 47.5,10 1.004,11 1.124,12 0.673,13 0.625,14 4.9,15 11,16 61,18 14,19 34,21 63,22 23,24 12,25 11,26 3,28 29,29 9,30 2,31 7.086}
{0 CHEMBL102815,1 42.5,2 0.159,3 32,4 475.69,7 7.798,8 37.7,9 47.5,10 1.004,11 1.124,12 0.673,13 0.625,14 4.9,15 11,16 61,18 14,19 34,21 63,22 23,24 12,25 11,26 3,28 29,29 9,30 2,31 7.569}
{0 CHEMBL103327,1 42.5,2 0.143,3 32,4 475.69,7 7.798,8 37.7,9 47.5,10 1.004,11 1.124,12 0.673,13 0.625,14 4.9,15 11,16 61,18 14,19 34,21 63,22 23,24 12,25 11,26 3,28 29,29 9,30 2,31 7.523}
{0 CHEMBL103378,1 43.5,2 0.172,3 33,4 507.76,7 8.19,8 37.1,9 46.8,10 1.005,11 1.121,12 0.688,13 0.634,14 4.8,15 11,16 62,18 14,19 35,21 64,22 23,24 12,25 11,26 3,28 29,29 10,30 3,31 7.26}
{0 CHEMBL103966,1 45,2 0.132,3 34,4 484.68,7 7.344,8 37.9,9 48.5,10 1.002,11 1.13,12 0.654,13 0.614,14 6.1,15 12,16 66,18 15,19 36,21 68,22 25,24 14,25 11,26 3,28 32,29 9,30 1,31 7.194}
{0 CHEMBL10436,1 55,2 0.138,3 36,4 500.54,7 8.206,8 42.6,9 41,10 1.007,11 1.123,12 0.7,13 0.663,14 9.8,15 28,16 61,18 29,19 40,21 65,22 26,24 22,25 4,26 1,28 25,29 10,30 1,31 6}
{0 CHEMBL104617,1 43.5,2 0.167,3 33,4 489.72,7 7.652,8 37.5,9 48.4,10 1.002,11 1.125,12 0.669,13 0.62,14 4.7,15 11,16 64,18 14,19 35,21 66,22 24,24 12,25 12,26 3,28 31,29 9,30 2,31 7.252}
{0 CHEMBL104814,1 44,2 0.136,3 33,4 469.66,7 7.338,8 39.1,9 48.4,10 1.001,11 1.126,12 0.658,13 0.617,14 4.7,15 12,16 64,18 15,19 35,21 66,22 25,24 14,25 11,26 3,28 31,29 8,30 1,31 7.114}
{0 CHEMBL105054,1 42.5,2 0.143,3 32,4 459.62,7 7.535,8 37.7,9 47.5,10 1.008,11 1.129,12 0.653,13 0.618,14 4.9,15 11,16 61,18 14,19 34,21 63,22 23,24 12,25 11,26 3,28 29,29 9,30 1,31 7.367}
{0 CHEMBL10555,1 54,2 0.127,3 35,4 485.52,7 8.229,8 44.1,9 40.7,10 1.005,11 1.119,12 0.707,13 0.669,14 8.5,15 28,16 59,18 29,19 39,21 63,22 26,24 23,25 3,26 1,28 24,29 9,30 1,31 6}
{0 CHEMBL1160183,1 46,2 0.175,3 33,4 473.51,7 7.762,8 37.7,9 45.9,10 1.012,11 1.129,12 0.661,13 0.625,14 4.9,15 16,16 61,18 19,19 35,21 63,22 23,24 16,25 7,26 3,28 28,29 10,30 1,31 4.432}
{0 CHEMBL1160184,1 43,2 0.155,3 33,4 477.6,7 6.922,8 34.8,9 52.2,10 0.999,11 1.135,12 0.636,13 0.587,14 4.3,15 10,16 69,18 13,19 35,21 71,22 24,24 10,25 14,26 3,28 36,29 9,30 1,31 5.319}
{0 CHEMBL1160185,1 43,2 0.159,3 33,4 479.57,7 7.158,8 34.3,9 50.7,10 1.006,11 1.136,12 0.636,13 0.593,14 4.5,15 10,16 67,18 13,19 35,21 69,22 23,24 10,25 13,26 3,28 34,29 10,30 1,31 4.319}
{0 CHEMBL1160186,1 46,2 0.169,3 33,4 471.54,7 7.485,8 38.1,9 47.6,10 1.005,11 1.128,12 0.661,13 0.618,14 4.8,15 16,16 63,18 19,19 35,21 65,22 24,24 16,25 8,26 3,28 30,29 9,30 1,31 4.215}
{0 CHEMBL1160203,1 38,2 0.183,3 29,4 423.5,7 7.178,8 33.9,9 50.8,10 1.005,11 1.137,12 0.638,13 0.592,14 5.1,15 10,16 59,18 13,19 30,21 60,22 20,24 10,25 10,26 3,28 30,29 9,30 1,31 5.699}
{0 CHEMBL121821,1 41.5,2 0.127,3 31,4 442.63,7 7.256,8 39.3,9 49.2,10 0.999,11 1.124,12 0.658,13 0.614,14 3.3,15 11,16 61,18 14,19 33,21 63,22 24,24 13,25 11,26 3,28 30,29 7,30 1,31 6.745}
{0 CHEMBL121856,1 46,2 0.141,3 35,4 498.7,7 7.228,8 39.1,9 49.3,10 1.001,11 1.125,12 0.654,13 0.612,14 2.9,15 12,16 69,18 15,19 37,21 71,22 27,24 15,25 12,26 3,28 34,29 8,30 1,31 6.432}
{0 CHEMBL124132,1 48,2 0.147,3 37,4 528.73,7 7.243,8 38.4,9 49.3,10 1.004,11 1.126,12 0.648,13 0.609,14 2.7,15 12,16 73,18 15,19 39,21 75,22 28,24 15,25 13,26 3,28 36,29 9,30 1,31 6.004}
{0 CHEMBL124766,1 44,2 0.136,3 33,4 469.66,7 7.338,8 39.1,9 48.4,10 1.001,11 1.126,12 0.658,13 0.617,14 4.7,15 12,16 64,18 15,19 35,21 66,22 25,24 14,25 11,26 3,28 31,29 8,30 1,31 6.824}
{0 CHEMBL125174,1 45,2 0.134,3 34,4 503.11,7 7.74,8 40,9 47.7,10 1.003,11 1.122,12 0.673,13 0.628,14 3.1,15 12,16 65,18 15,19 36,21 67,22 26,23 1,24 15,25 11,26 3,28 31,29 8,30 2,31 6.092}
{0 CHEMBL125234,1 42.5,2 0.141,3 32,4 458.63,7 7.397,8 38.7,9 48.4,10 1.005,11 1.125,12 0.655,13 0.616,14 3.2,15 11,16 62,18 14,19 34,21 64,22 24,24 13,25 11,26 3,28 30,29 8,30 1,31 6.523}
{0 CHEMBL125593,1 41.5,2 0.127,3 31,4 442.63,7 7.256,8 39.3,9 49.2,10 0.999,11 1.124,12 0.658,13 0.614,14 3.3,15 11,16 61,18 14,19 33,21 63,22 24,24 13,25 11,26 3,28 30,29 7,30 1,31 6.495}
{0 CHEMBL125655,1 41,2 0.123,3 33,4 474.73,7 6.686,8 36.6,9 53.5,10 0.993,11 1.13,12 0.636,13 0.586,14 2.8,15 6,16 71,18 9,19 35,21 73,22 26,24 9,25 17,26 3,28 38,29 7,30 1,31 6.31}
{0 CHEMBL125987,1 48,2 0.129,3 37,4 536.67,7 7.892,8 39.7,9 45.6,10 1.019,11 1.138,12 0.654,13 0.627,14 2.9,15 12,16 68,18 15,19 39,21 70,22 27,24 15,25 12,26 3,27 3,28 31,29 10,30 1,31 6.187}
{0 CHEMBL126045,1 45,2 0.134,3 34,4 486.66,7 7.487,8 40,9 47.7,10 1.005,11 1.128,12 0.659,13 0.621,14 3.1,15 12,16 65,18 15,19 36,21 67,22 26,24 15,25 11,26 3,27 1,28 31,29 8,30 1,31 6.187}
{0 CHEMBL145943,1 40.5,2 0.179,3 29,4 420.44,7 7.786,8 37,9 46.3,10 1.014,11 1.129,12 0.658,13 0.622,14 3.7,15 15,16 54,18 17,19 31,21 56,22 20,24 13,25 7,26 2,28 25,29 9,30 1,31 7.013}
{0 CHEMBL146936,1 35.5,2 0.143,3 24,4 349.3,7 8.732,8 40,9 40,10 1.028,11 1.12,12 0.688,13 0.661,14 2.5,15 15,16 40,18 17,19 26,21 42,22 16,24 13,25 3,26 2,28 16,29 8,30 1,31 7.658}
{0 CHEMBL147041,1 41,2 0.122,3 27,4 386.39,7 8.4,8 37,9 41.3,10 1.016,11 1.136,12 0.683,13 0.65,14 13,15 20,16 46,18 21,19 30,21 49,22 17,24 13,25 4,26 1,28 19,29 10,30 1,31 5.398}
{0 CHEMBL147157,1 65,2 0.135,3 42,4 586.57,7 8.501,8 44.9,9 39.1,10 1.019,11 1.113,12 0.699,13 0.674,14 2.9,15 30,16 69,18 33,19 47,21 74,22 31,24 26,25 5,26 3,28 27,29 11,30 1,31 8.194}
{0 CHEMBL147163,1 40.5,2 0.13,3 27,4 385.35,7 8.962,8 39.5,9 37.2,10 1.025,11 1.129,12 0.7,13 0.676,14 11.6,15 17,16 43,18 19,19 30,21 46,22 17,24 14,25 3,26 2,28 16,29 10,30 1,31 7.523}
{0 CHEMBL147847,1 43,2 0.177,3 34,4 503.49,5 2,6 1,7 8.121,8 33.9,9 45.2,10 1.032,11 1.148,12 0.636,13 0.615,14 4.8,15 6,16 62,18 11,19 34,21 62,22 21,24 9,25 10,26 4,27 2,28 28,29 13,30 1,31 8.097}
{0 CHEMBL147964,1 59.5,2 0.13,3 38,4 527.56,7 8.243,8 43.8,9 40.6,10 1.008,11 1.119,12 0.702,13 0.667,14 7.8,15 31,16 64,18 32,19 43,21 69,22 28,24 23,25 5,26 1,28 26,29 10,30 1,31 6.357}
{0 CHEMBL148056,1 40,2 0.133,3 26,4 373.34,7 8.889,8 38.1,9 38.1,10 1.026,11 1.132,12 0.693,13 0.668,14 11.9,15 20,16 42,18 21,19 29,21 45,22 16,24 13,25 3,26 1,28 16,29 10,30 1,31 8.222}
{0 CHEMBL148232,1 41.5,2 0.167,3 30,4 433.48,7 7.474,8 37.9,9 48.3,10 1.007,11 1.126,12 0.656,13 0.614,14 1.7,15 15,16 58,18 17,19 32,21 60,22 22,24 13,25 9,26 2,28 28,29 8,30 1,31 7.187}
{0 CHEMBL155874,1 52,2 0.14,3 34,4 542.44,7 10.045,8 44.4,9 37,10 1.022,11 1.112,12 0.725,13 0.696,14 5.6,15 22,16 54,18 26,19 37,20 1,21 57,22 24,24 22,25 2,26 4,28 20,29 10,30 2,31 6}
{0 CHEMBL1560,1 16,2 0.103,3 14,4 217.32,7 7.494,8 31,9 51.7,10 1.012,11 1.136,12 0.633,13 0.588,14 3.4,16 29,18 2,19 14,21 29,22 9,24 2,25 7,26 2,28 15,29 5,30 1,31 5}
{0 CHEMBL156638,1 34,2 0.133,3 23,4 324.48,7 7.546,8 44.2,9 46.5,10 0.99,11 1.113,12 0.697,13 0.644,14 4.7,15 16,16 43,18 17,19 25,21 45,22 19,24 15,25 4,26 1,28 20,29 4,30 1,31 5.77}
{0 CHEMBL156740,1 31.5,2 0.128,3 21,4 316.48,7 8.554,8 43.2,9 43.2,10 0.996,11 1.107,12 0.732,13 0.671,14 5.4,15 15,16 37,18 16,19 23,21 39,22 16,24 13,25 3,26 1,28 16,29 5,30 2,31 5.284}
{0 CHEMBL156879,1 38,2 0.14,3 26,4 362.53,7 7.553,8 45.8,9 45.8,10 0.988,11 1.11,12 0.703,13 0.65,14 4.2,15 18,16 48,18 19,19 28,21 50,22 22,24 18,25 4,26 1,28 22,29 4,30 1,31 5.284}
{0 CHEMBL156964,1 46,2 0.153,3 31,4 431.6,7 7.707,8 44.6,9 44.6,10 0.996,11 1.114,12 0.696,13 0.651,14 5.4,15 22,16 56,18 23,19 34,21 59,22 25,24 20,25 5,26 1,28 25,29 6,30 1,31 5.114}
{0 CHEMBL157249,1 40,2 0.167,3 28,4 396.55,7 7.626,8 42.3,9 46.2,10 1,11 1.118,12 0.681,13 0.638,14 3.8,15 16,16 52,18 18,19 30,21 54,22 22,24 16,25 6,26 2,28 24,29 6,30 1,31 5.268}
{0 CHEMBL160153,1 43.5,2 0.151,3 30,4 447.59,7 8.776,8 37.3,9 41.2,10 1.02,11 1.127,12 0.691,13 0.658,14 9.8,15 17,16 51,18 20,19 32,21 53,22 19,24 14,25 5,26 3,28 21,29 11,30 2,31 6}
{0 CHEMBL173287,1 26,2 0.182,3 21,4 309.47,7 7.033,8 36.4,9 52.3,10 0.997,11 1.128,12 0.645,13 0.594,14 2.3,15 6,16 44,18 8,19 21,21 44,22 16,24 8,25 8,26 2,28 23,29 5,30 1,31 5}
{0 CHEMBL177000,1 53.5,2 0.119,3 37,4 541.7,7 8.464,8 40.6,9 42.2,10 1.016,11 1.118,12 0.69,13 0.657,14 4.7,15 17,16 64,18 22,19 40,21 67,22 26,24 19,25 7,26 5,28 27,29 11,30 2,31 4.963}
{0 CHEMBL1788203,1 25,2 0.184,3 19,4 285.4,7 7.511,8 34.2,9 50,10 1.012,11 1.131,12 0.64,13 0.6,14 2.6,15 6,16 38,18 9,19 19,21 38,22 13,24 7,25 6,26 3,28 19,29 6,30 1,31 4}
{0 CHEMBL1794047,1 56,2 0.192,3 41,4 582.64,7 7.666,8 39.5,9 46.1,10 1.011,11 1.124,12 0.661,13 0.627,14 2.6,15 18,16 76,18 22,19 43,21 78,22 30,24 21,25 9,26 4,28 35,29 11,30 1,31 4}
{0 CHEMBL18461,1 54,2 0.175,3 40,4 571.67,7 7.329,8 37.2,9 48.7,10 1.006,11 1.13,12 0.649,13 0.609,14 3.8,15 16,16 78,18 20,19 42,21 80,22 29,24 17,25 12,26 4,28 38,29 11,30 1,31 5.301}
{0 CHEMBL191879,1 45,2 0.136,3 34,4 497.53,7 8.884,8 41.1,9 39.3,10 1.041,11 1.137,12 0.667,13 0.66,14 1.8,15 12,16 56,18 14,19 37,21 59,22 23,24 14,25 9,26 2,27 3,28 22,29 11,30 1,31 7.116}
{0 CHEMBL192441,1 28,2 0.13,3 23,4 344.47,7 7.655,8 35.6,9 48.9,10 1.015,11 1.146,12 0.64,13 0.605,14 4.4,15 6,16 45,18 7,19 24,21 46,22 16,24 7,25 9,26 1,27 2,28 22,29 7,30 1,31 5.963}
{0 CHEMBL193454,1 48,2 0.121,3 33,4 443.61,7 7.041,8 44.4,9 47.6,10 0.992,11 1.125,12 0.668,13 0.628,14 4.8,15 22,16 63,18 23,19 36,21 66,22 28,24 21,25 7,26 1,27 1,28 30,29 5,31 5}
{0 CHEMBL193490,1 54,2 0.134,3 39,4 559.6,7 8.883,8 44.4,9 38.1,10 1.034,11 1.128,12 0.684,13 0.675,14 1.6,15 18,16 63,18 20,19 43,21 67,22 28,24 20,25 8,26 2,27 3,28 24,29 11,30 1,31 6.318}
{0 CHEMBL194370,1 50,2 0.118,3 34,4 453.63,7 6.979,8 44.6,9 47.7,10 0.99,11 1.119,12 0.671,13 0.629,14 4.6,15 22,16 65,18 24,19 37,21 68,22 29,24 22,25 7,26 2,28 31,29 5,31 5.292}
{0 CHEMBL194648,1 48.5,2 0.109,3 33,4 460.65,7 7.552,8 42.6,9 45.9,10 0.996,11 1.12,12 0.684,13 0.64,14 6.6,15 21,16 61,18 23,19 36,21 64,22 26,24 19,25 7,26 2,28 28,29 7,30 1,31 5.658}
{0 CHEMBL194651,1 34,2 0.135,3 26,4 378.54,7 7.571,8 38,9 48,10 1.005,11 1.143,12 0.658,13 0.617,14 8,15 12,16 50,18 12,19 28,21 52,22 19,24 10,25 9,27 2,28 24,29 7,30 1,31 7.56}
{0 CHEMBL194739,1 50,2 0.108,3 34,4 473.66,7 7.64,8 45.2,9 45.2,10 0.995,11 1.119,12 0.693,13 0.648,14 4.8,15 22,16 62,18 24,19 37,21 65,22 28,24 22,25 6,26 2,27 1,28 28,29 6,30 1,31 6.18}
{0 CHEMBL194966,1 51,2 0.108,3 35,4 475.58,7 7.671,8 45.2,9 43.5,10 1.008,11 1.129,12 0.673,13 0.647,14 4.8,15 22,16 62,18 24,19 38,21 65,22 28,24 22,25 6,26 2,27 2,28 27,29 7,31 6.187}
{0 CHEMBL195052,1 50,2 0.108,3 34,4 457.59,7 7.38,8 45.2,9 45.2,10 0.999,11 1.123,12 0.674,13 0.641,14 4.8,15 22,16 62,18 24,19 37,21 65,22 28,24 22,25 6,26 2,27 1,28 28,29 6,31 5.155}
{0 CHEMBL195182,1 54.5,2 0.104,3 36,4 482.6,7 7.66,8 46,9 42.9,10 1.003,11 1.123,12 0.683,13 0.654,14 6.3,15 27,16 63,18 28,19 40,21 67,22 29,24 23,25 6,26 1,27 1,28 27,29 7,31 5}
{0 CHEMBL195318,1 51,2 0.118,3 35,4 471.62,7 7.256,8 44.6,9 46.2,10 0.998,11 1.124,12 0.67,13 0.635,14 4.6,15 22,16 65,18 24,19 38,21 68,22 29,24 22,25 7,26 2,27 1,28 30,29 6,31 6.131}
{0 CHEMBL196057,1 52,2 0.104,3 35,4 469.6,7 7.454,8 46,9 44.4,10 0.999,11 1.121,12 0.679,13 0.646,14 4.8,15 22,16 63,18 24,19 39,21 67,22 29,24 22,25 7,26 2,27 1,28 28,29 6,31 5.194}
{0 CHEMBL196108,1 53,2 0.1,3 36,4 483.63,7 7.328,8 45.5,9 45.5,10 0.998,11 1.122,12 0.675,13 0.64,14 4.5,15 22,16 66,18 24,19 40,21 70,22 30,24 22,25 8,26 2,27 1,28 30,29 6,31 6.921}
{0 CHEMBL196164,1 54,2 0.118,3 37,4 501.6,7 7.717,8 44.6,9 43.1,10 1.009,11 1.124,12 0.672,13 0.649,14 4.6,15 22,16 65,18 25,19 40,21 68,22 29,24 23,25 6,26 3,27 1,28 28,29 8,31 6.409}
{0 CHEMBL196287,1 50,2 0.108,3 34,4 457.59,7 7.38,8 45.2,9 45.2,10 0.999,11 1.123,12 0.674,13 0.641,14 4.8,15 22,16 62,18 24,19 37,21 65,22 28,24 22,25 6,26 2,27 1,28 28,29 6,31 6.658}
{0 CHEMBL196327,1 51,2 0.109,3 35,4 493.02,7 8.082,8 44.3,9 42.6,10 1.008,11 1.126,12 0.686,13 0.657,14 6.6,15 22,16 61,18 24,19 38,21 64,22 27,23 1,24 21,25 6,26 2,27 1,28 26,29 8,30 1,31 6.357}
{0 CHEMBL196354,1 50,2 0.103,3 34,4 453.63,7 6.979,8 44.6,9 47.7,10 0.99,11 1.119,12 0.671,13 0.629,14 4.6,15 22,16 65,18 24,19 37,21 68,22 29,24 22,25 7,26 2,28 31,29 5,31 5.523}
{0 CHEMBL196376,1 51,2 0.106,3 35,4 473.6,7 7.517,8 42.9,9 44.4,10 1.004,11 1.131,12 0.667,13 0.639,14 7.9,15 22,16 63,18 24,19 38,21 66,22 27,24 21,25 6,26 2,27 1,28 28,29 8,31 5.921}
{0 CHEMBL196380,1 46,2 0.099,3 33,4 445.66,7 6.554,8 41.2,9 51.5,10 0.987,11 1.126,12 0.649,13 0.602,14 4.4,15 16,16 68,18 18,19 36,21 71,22 28,24 16,25 12,26 2,28 35,29 5,31 6.066}
{0 CHEMBL196503,1 48.5,2 0.117,3 33,4 465.6,7 8.168,8 42.1,9 42.1,10 1.01,11 1.128,12 0.687,13 0.656,14 8.8,15 21,16 57,18 23,19 36,21 60,22 24,24 18,25 6,26 2,27 1,28 24,29 9,30 1,31 5.638}
{0 CHEMBL196584,1 48.5,2 0.113,3 33,4 447.56,7 7.586,8 42.4,9 44.1,10 1.007,11 1.132,12 0.665,13 0.639,14 8.5,15 21,16 59,18 23,19 36,21 62,22 25,24 19,25 6,26 2,27 1,28 26,29 8,31 5}
{0 CHEMBL197025,1 60,2 0.146,3 42,4 592.8,7 7.504,8 40.5,9 46.8,10 1.004,11 1.128,12 0.663,13 0.626,14 5.1,15 22,16 79,18 26,19 45,21 82,22 32,24 22,25 10,26 4,27 1,28 37,29 10,30 1,31 6.699}
{0 CHEMBL197247,1 71,2 0.125,3 48,4 669.84,7 7.974,8 42.9,9 42.9,10 1.01,11 1.124,12 0.679,13 0.651,14 6,15 28,16 84,18 33,19 52,21 88,22 36,24 29,25 7,26 5,27 1,28 36,29 12,30 1,31 6.824}
{0 CHEMBL197264,1 51,2 0.106,3 35,4 473.6,7 7.517,8 42.9,9 44.4,10 1.004,11 1.131,12 0.667,13 0.639,14 7.9,15 22,16 63,18 24,19 38,21 66,22 27,24 21,25 6,26 2,27 1,28 28,29 8,31 6.77}
{0 CHEMBL197355,1 56,2 0.107,3 39,4 528.68,7 7.343,8 43.1,9 45.8,10 1.002,11 1.128,12 0.663,13 0.632,14 5.6,15 22,16 72,18 25,19 42,21 75,22 31,24 23,25 8,26 3,27 1,28 33,29 8,31 6.678}
{0 CHEMBL197361,1 52,2 0.121,3 35,4 493.65,7 7.836,8 42.9,9 44.4,10 1.006,11 1.123,12 0.68,13 0.645,14 4.8,15 22,16 63,18 25,19 38,21 66,22 27,24 21,25 6,26 3,27 1,28 28,29 8,30 1,31 5.174}
{0 CHEMBL2092878,1 25,2 0.184,3 19,4 285.4,7 7.511,8 34.2,9 50,10 1.012,11 1.131,12 0.64,13 0.6,14 2.6,15 6,16 38,18 9,19 19,21 38,22 13,24 7,25 6,26 3,28 19,29 6,30 1,31 4}
{0 CHEMBL211383,1 34,2 0.133,3 27,4 373.54,7 6.44,8 37.9,9 53.4,10 0.994,11 1.13,12 0.625,13 0.582,14 1.7,15 6,16 58,18 8,19 29,21 60,22 22,24 8,25 14,26 2,28 31,29 5,31 5.523}
{0 CHEMBL2114403,1 42,2 0.125,3 29,4 408.56,7 7.709,8 43.4,9 45.3,10 1,11 1.115,12 0.687,13 0.645,14 3.8,15 16,16 53,18 18,19 32,21 56,22 23,24 16,25 7,26 2,28 24,29 6,30 1,31 6.167}
{0 CHEMBL2114468,1 45,2 0.143,3 34,4 482.7,7 7.099,8 39.7,9 50,10 0.996,11 1.123,12 0.657,13 0.611,14 2.9,15 12,16 68,18 15,19 36,21 70,22 27,24 15,25 12,26 3,28 34,29 7,30 1,31 6.387}
{0 CHEMBL211500,1 28.5,2 0.163,3 23,4 339.51,7 7.073,8 33.3,9 52.1,10 1.002,11 1.138,12 0.633,13 0.587,14 6.3,15 5,16 48,18 7,19 24,21 49,22 16,24 4,25 12,26 2,28 25,29 7,30 1,31 5.523}
{0 CHEMBL2115345,1 42,2 0.125,3 29,4 408.56,7 7.709,8 43.4,9 45.3,10 1,11 1.115,12 0.687,13 0.645,14 3.8,15 16,16 53,18 18,19 32,21 56,22 23,24 16,25 7,26 2,28 24,29 6,30 1,31 5.943}
{0 CHEMBL2115491,1 45,2 0.143,3 34,4 482.7,7 7.099,8 39.7,9 50,10 0.996,11 1.123,12 0.657,13 0.611,14 2.9,15 12,16 68,18 15,19 36,21 70,22 27,24 15,25 12,26 3,28 34,29 7,30 1,31 7.013}
{0 CHEMBL2115557,1 32,2 0.212,3 26,4 382.53,7 7.356,8 34.6,9 50,10 1.01,11 1.134,12 0.636,13 0.599,14 3.8,15 6,16 52,18 9,19 26,21 52,22 18,24 9,25 9,26 3,28 26,29 8,30 1,31 5.398}
{0 CHEMBL212526,1 34,2 0.133,3 27,4 373.54,7 6.44,8 37.9,9 53.4,10 0.994,11 1.13,12 0.625,13 0.582,14 1.7,15 6,16 58,18 8,19 29,21 60,22 22,24 8,25 14,26 2,28 31,29 5,31 5.523}
{0 CHEMBL22957,1 86.5,2 0.197,3 62,4 890.1,7 7.543,8 38.1,9 47.5,10 1.007,11 1.127,12 0.658,13 0.619,14 4.2,15 27,16 118,18 34,19 66,21 122,22 45,24 28,25 17,26 7,28 56,29 17,30 2,31 7.602}
{0 CHEMBL23598,1 63,2 0.2,3 47,4 691.87,7 7.439,8 34.4,9 49.5,10 1.008,11 1.135,12 0.645,13 0.602,14 5.4,15 16,16 93,18 22,19 49,21 95,22 32,24 17,25 15,26 6,28 46,29 15,30 2,31 6.301}
{0 CHEMBL24910,1 61,2 0.218,3 45,4 637.74,7 7.503,8 37.6,9 47.1,10 1.008,11 1.131,12 0.654,13 0.618,14 5.9,15 18,16 85,18 23,19 47,21 87,22 32,24 22,25 10,26 5,28 40,29 13,30 1,31 5.367}
{0 CHEMBL24919,1 57,2 0.193,3 42,4 594.7,7 7.342,8 39.5,9 48.1,10 1.003,11 1.124,12 0.659,13 0.617,14 2.5,15 18,16 81,18 22,19 44,21 83,22 32,24 21,25 11,26 4,28 39,29 10,30 1,31 5.398}
{0 CHEMBL24923,1 56,2 0.188,3 41,4 580.67,7 7.444,8 39.7,9 47.4,10 1.005,11 1.124,12 0.661,13 0.621,14 2.6,15 18,16 78,18 22,19 43,21 80,22 31,24 21,25 10,26 4,28 37,29 10,30 1,31 4.111}
{0 CHEMBL25154,1 59,2 0.213,3 43,4 610.65,7 7.829,8 39.7,9 44.9,10 1.015,11 1.124,12 0.663,13 0.633,14 2.6,15 18,16 78,18 23,19 45,21 80,22 31,24 22,25 9,26 5,28 35,29 12,30 1,31 4.602}
{0 CHEMBL25221,1 78,2 0.205,3 57,4 826.01,7 7.578,8 36.7,9 47.7,10 1.01,11 1.13,12 0.653,13 0.615,14 4.6,15 22,16 109,18 29,19 60,21 112,22 40,24 24,25 16,26 7,28 52,29 17,30 2,31 6.409}
{0 CHEMBL25341,1 54,2 0.203,3 39,4 552.61,7 7.675,8 40.3,9 45.8,10 1.008,11 1.123,12 0.667,13 0.631,14 2.8,15 18,16 72,18 22,19 41,21 74,22 29,24 21,25 8,26 4,28 33,29 10,30 1,31 4.301}
{0 CHEMBL262267,1 43,2 0.123,3 30,4 424.56,7 7.862,8 42.6,9 44.4,10 1.006,11 1.117,12 0.682,13 0.646,14 3.7,15 16,16 54,18 18,19 33,21 57,22 23,24 16,25 7,26 2,28 24,29 7,30 1,31 7.046}
{0 CHEMBL262392,1 64,2 0.161,3 45,4 631.72,7 7.611,8 41,9 45.8,10 1.006,11 1.122,12 0.67,13 0.632,14 3.6,15 22,16 83,18 26,19 49,21 87,22 34,24 23,25 11,26 4,28 38,29 11,30 1,31 6.721}
{0 CHEMBL262783,1 62,2 0.176,3 44,4 619.71,7 7.557,8 40.2,9 46.3,10 1.006,11 1.124,12 0.666,13 0.628,14 3.7,15 22,16 82,18 26,19 47,21 85,22 33,24 23,25 10,26 4,28 38,29 11,30 1,31 5.554}
{0 CHEMBL263501,1 25,2 0.184,3 19,4 285.4,7 7.511,8 34.2,9 50,10 1.012,11 1.131,12 0.64,13 0.6,14 2.6,15 6,16 38,18 9,19 19,21 38,22 13,24 7,25 6,26 3,28 19,29 6,30 1,31 4.301}
{0 CHEMBL264206,1 62,2 0.145,3 43,4 601.69,7 7.616,8 41.8,9 45.6,10 1.003,11 1.121,12 0.676,13 0.636,14 3.8,15 22,16 79,18 26,19 47,21 83,22 33,24 23,25 10,26 4,28 36,29 10,30 1,31 6.602}
{0 CHEMBL26703,1 62.5,2 0.195,3 44,4 618.68,7 7.831,8 40.5,9 44.3,10 1.01,11 1.124,12 0.672,13 0.639,14 5.1,15 23,16 79,18 27,19 47,21 82,22 32,24 24,25 8,26 4,28 35,29 12,30 1,31 4.699}
{0 CHEMBL26814,1 58,2 0.208,3 42,4 596.62,7 7.955,8 40,9 44,10 1.017,11 1.123,12 0.666,13 0.638,14 2.7,15 18,16 75,18 23,19 44,21 77,22 30,24 22,25 8,26 5,28 33,29 12,30 1,31 4.523}
{0 CHEMBL268473,1 51.5,2 0.143,3 35,4 493.5,7 8.364,8 40.7,9 40.7,10 1.016,11 1.126,12 0.688,13 0.659,14 8.5,15 23,16 59,18 24,19 39,21 63,22 24,24 19,25 5,26 1,28 24,29 11,30 1,31 7.032}
{0 CHEMBL268761,1 55,2 0.138,3 36,4 500.54,7 8.206,8 42.6,9 41,10 1.007,11 1.123,12 0.7,13 0.663,14 9.8,15 28,16 61,18 29,19 40,21 65,22 26,24 22,25 4,26 1,28 25,29 10,30 1,31 7.638}
{0 CHEMBL27110,1 57,2 0.193,3 42,4 594.7,7 7.342,8 39.5,9 48.1,10 1.003,11 1.124,12 0.659,13 0.617,14 2.5,15 18,16 81,18 22,19 44,21 83,22 32,24 21,25 11,26 4,28 39,29 10,30 1,31 4.669}
{0 CHEMBL27111,1 58,2 0.212,3 43,4 609.72,7 7.346,8 38.6,9 48.2,10 1.004,11 1.127,12 0.655,13 0.614,14 3.6,15 18,16 83,18 22,19 45,21 85,22 32,24 21,25 11,26 4,28 40,29 11,30 1,31 4.373}
{0 CHEMBL27164,1 54,2 0.189,3 39,4 552.61,7 7.675,8 40.3,9 45.8,10 1.008,11 1.123,12 0.667,13 0.631,14 2.8,15 18,16 72,18 22,19 41,21 74,22 29,24 21,25 8,26 4,28 33,29 10,30 1,31 5.097}
{0 CHEMBL27273,1 56,2 0.188,3 41,4 580.67,7 7.444,8 39.7,9 47.4,10 1.005,11 1.124,12 0.661,13 0.621,14 2.6,15 18,16 78,18 22,19 43,21 80,22 31,24 21,25 10,26 4,28 37,29 10,30 1,31 4.097}
{0 CHEMBL273244,1 55,2 0.136,3 36,4 499.55,7 8.057,8 43.5,9 41.9,10 1.003,11 1.12,12 0.701,13 0.661,14 8.1,15 28,16 62,18 29,19 40,21 66,22 27,24 23,25 4,26 1,28 26,29 9,30 1,31 5.854}
{0 CHEMBL273489,1 51.5,2 0.143,3 35,4 493.5,7 8.364,8 40.7,9 40.7,10 1.016,11 1.126,12 0.688,13 0.659,14 8.5,15 23,16 59,18 24,19 39,21 63,22 24,24 19,25 5,26 1,28 24,29 11,30 1,31 6.409}
{0 CHEMBL275222,1 54,2 0.127,3 35,4 485.52,7 8.229,8 44.1,9 40.7,10 1.005,11 1.119,12 0.707,13 0.669,14 8.5,15 28,16 59,18 29,19 39,21 63,22 26,24 23,25 3,26 1,28 24,29 9,30 1,31 6}
{0 CHEMBL276690,1 51.5,2 0.143,3 35,4 493.5,7 8.364,8 40.7,9 40.7,10 1.016,11 1.126,12 0.688,13 0.659,14 8.5,15 23,16 59,18 24,19 39,21 63,22 24,24 19,25 5,26 1,28 24,29 11,30 1,31 6.959}
{0 CHEMBL276872,1 47.5,2 0.153,3 32,4 449.49,7 8.027,8 41.1,9 42.9,10 1.005,11 1.125,12 0.691,13 0.651,14 8.9,15 23,16 56,18 24,19 35,21 59,22 23,24 19,25 4,26 1,28 24,29 9,30 1,31 6.553}
{0 CHEMBL278076,1 72,2 0.187,3 53,4 746.92,7 7.182,8 38.5,9 49,10 1.002,11 1.128,12 0.65,13 0.609,14 3.8,15 22,16 104,18 27,19 56,21 107,22 40,24 24,25 16,26 5,28 51,29 13,30 1,31 6.796}
{0 CHEMBL27842,1 58,2 0.205,3 42,4 595.64,7 7.837,8 39.5,9 44.7,10 1.014,11 1.125,12 0.665,13 0.633,14 3.9,15 18,16 76,18 23,19 44,21 78,22 30,24 22,25 8,26 5,28 34,29 12,30 1,31 4.699}
{0 CHEMBL27868,1 59,2 0.21,3 43,4 609.67,7 7.717,8 39.2,9 45.6,10 1.012,11 1.126,12 0.662,13 0.629,14 3.8,15 18,16 79,18 23,19 45,21 81,22 31,24 22,25 9,26 5,28 36,29 12,30 1,31 4}
{0 CHEMBL278754,1 65,2 0.186,3 46,4 644.71,7 7.768,8 42.2,9 44.6,10 1.008,11 1.119,12 0.675,13 0.641,14 2.4,15 24,16 83,18 28,19 49,21 86,22 35,24 27,25 8,26 4,28 37,29 11,30 1,31 4.921}
{0 CHEMBL27880,1 64,2 0.188,3 45,4 628.71,7 7.667,8 42.7,9 45.1,10 1.005,11 1.118,12 0.678,13 0.64,14 2.4,15 24,16 82,18 28,19 48,21 85,22 35,24 27,25 8,26 4,28 37,29 10,30 1,31 5}
{0 CHEMBL280152,1 71.5,2 0.19,3 52,4 755.96,7 7.411,8 36.3,9 49,10 1.005,11 1.131,12 0.652,13 0.608,14 4.9,15 21,16 102,18 27,19 55,21 105,22 37,24 21,25 16,26 6,28 50,29 15,30 2,31 7.187}
{0 CHEMBL280907,1 79,2 0.209,3 58,4 840.04,7 7.5,8 36.6,9 48.2,10 1.008,11 1.13,12 0.651,13 0.612,14 4.5,15 22,16 112,18 29,19 61,21 115,22 41,24 24,25 17,26 7,28 54,29 17,30 2,31 6.301}
{0 CHEMBL281237,1 70,2 0.178,3 48,4 667.75,7 7.765,8 43,9 44.2,10 1.006,11 1.118,12 0.681,13 0.645,14 3.5,15 28,16 86,18 32,19 52,21 90,22 37,24 29,25 8,26 4,28 38,29 11,30 1,31 5.598}
{0 CHEMBL28153,1 59,2 0.213,3 43,4 610.65,7 7.829,8 39.7,9 44.9,10 1.015,11 1.124,12 0.663,13 0.633,14 2.6,15 18,16 78,18 23,19 45,21 80,22 31,24 22,25 9,26 5,28 35,29 12,30 1,31 4}
{0 CHEMBL282118,1 64,2 0.188,3 45,4 628.71,7 7.667,8 42.7,9 45.1,10 1.005,11 1.118,12 0.678,13 0.64,14 2.4,15 24,16 82,18 28,19 48,21 85,22 35,24 27,25 8,26 4,28 37,29 10,30 1,31 4}
{0 CHEMBL28215,1 61,2 0.218,3 45,4 637.74,7 7.503,8 37.6,9 47.1,10 1.008,11 1.131,12 0.654,13 0.618,14 5.9,15 18,16 85,18 23,19 47,21 87,22 32,24 22,25 10,26 5,28 40,29 13,30 1,31 4}
{0 CHEMBL282158,1 53,2 0.197,3 38,4 538.58,7 7.806,8 40.6,9 44.9,10 1.01,11 1.122,12 0.671,13 0.636,14 2.9,15 18,16 69,18 22,19 40,21 71,22 28,24 21,25 7,26 4,28 31,29 10,30 1,31 4.097}
{0 CHEMBL282660,1 72,2 0.212,3 55,4 806.03,7 7.262,8 34.2,9 50.5,10 1.007,11 1.135,12 0.637,13 0.595,14 4.5,15 16,16 111,18 23,19 57,21 113,22 38,24 18,25 20,26 7,28 56,29 17,30 2,31 7.398}
{0 CHEMBL28273,1 57,2 0.205,3 42,4 594.7,7 7.342,8 39.5,9 48.1,10 1.003,11 1.124,12 0.659,13 0.617,14 2.5,15 18,16 81,18 22,19 44,21 83,22 32,24 21,25 11,26 4,28 39,29 10,30 1,31 4.921}
{0 CHEMBL282889,1 70.5,2 0.168,3 49,4 683.8,7 7.514,8 41.8,9 46.2,10 1.003,11 1.121,12 0.672,13 0.632,14 3.3,15 27,16 91,18 31,19 53,21 95,22 38,24 27,25 11,26 4,28 42,29 11,30 1,31 5.481}
{0 CHEMBL285204,1 40,2 0.148,3 28,4 396.55,7 7.626,8 42.3,9 46.2,10 1,11 1.118,12 0.681,13 0.638,14 3.8,15 16,16 52,18 18,19 30,21 54,22 22,24 16,25 6,26 2,28 24,29 6,30 1,31 6.699}
{0 CHEMBL285447,1 42,2 0.125,3 29,4 408.56,7 7.709,8 43.4,9 45.3,10 1,11 1.115,12 0.687,13 0.645,14 3.8,15 16,16 53,18 18,19 32,21 56,22 23,24 16,25 7,26 2,28 24,29 6,30 1,31 6.538}
{0 CHEMBL285490,1 42,2 0.125,3 29,4 408.56,7 7.709,8 43.4,9 45.3,10 1,11 1.115,12 0.687,13 0.645,14 3.8,15 16,16 53,18 18,19 32,21 56,22 23,24 16,25 7,26 2,28 24,29 6,30 1,31 7.585}
{0 CHEMBL285619,1 56,2 0.145,3 37,4 513.58,7 7.901,8 43.1,9 43.1,10 1.001,11 1.12,12 0.696,13 0.654,14 7.7,15 28,16 65,18 29,19 41,21 69,22 28,24 23,25 5,26 1,28 28,29 9,30 1,31 7.869}
{0 CHEMBL285960,1 50,2 0.138,3 34,4 472.65,7 7.623,8 45.2,9 45.2,10 0.996,11 1.112,12 0.692,13 0.649,14 3.2,15 22,16 62,18 24,19 37,21 65,22 28,24 22,25 6,26 2,28 28,29 6,30 1,31 6.658}
{0 CHEMBL286038,1 56,2 0.184,3 39,4 547.64,7 7.502,8 41.1,9 46.6,10 1.001,11 1.122,12 0.673,13 0.63,14 4.1,15 22,16 73,18 25,19 42,21 76,22 30,24 22,25 8,26 3,28 34,29 9,30 1,31 6.398}
{0 CHEMBL287261,1 45.5,2 0.127,3 30,4 418.55,7 8.049,8 46.2,9 42.3,10 1.002,11 1.11,12 0.705,13 0.666,14 3.8,15 21,16 52,18 23,19 33,21 55,22 24,24 20,25 4,26 2,28 22,29 6,30 1,31 5.807}
{0 CHEMBL287358,1 29,2 0.041,3 23,4 335.51,7 6.99,8 37.5,9 52.1,10 0.995,11 1.126,12 0.649,13 0.597,14 2.1,15 6,16 48,18 8,19 24,21 49,22 18,24 8,25 10,26 2,28 25,29 5,30 1,31 6.208}
{0 CHEMBL287801,1 43,2 0.119,3 30,4 422.59,7 7.546,8 42.9,9 46.4,10 0.998,11 1.117,12 0.681,13 0.637,14 3.6,15 16,16 56,18 18,19 33,21 59,22 24,24 16,25 8,26 2,28 26,29 6,30 1,31 5.907}
{0 CHEMBL287971,1 33,2 0.163,3 26,4 388.39,5 2,6 1,7 7.926,8 34.7,9 46.9,10 1.023,11 1.147,12 0.643,13 0.61,14 4.1,15 6,16 49,18 9,19 26,21 49,22 17,24 7,25 8,26 2,27 2,28 23,29 9,30 1,31 6.854}
{0 CHEMBL288302,1 48,2 0.136,3 32,4 444.59,7 7.939,8 46.4,9 42.9,10 1,11 1.109,12 0.704,13 0.664,14 3.6,15 22,16 56,18 24,19 35,21 59,22 26,24 22,25 4,26 2,28 24,29 6,30 1,31 6.046}
{0 CHEMBL288432,1 43,2 0.177,3 34,4 503.49,5 2,6 1,7 8.121,8 33.9,9 45.2,10 1.032,11 1.148,12 0.636,13 0.615,14 4.8,15 6,16 62,18 11,19 34,21 62,22 21,24 9,25 10,26 4,27 2,28 28,29 13,30 1,31 8.097}
{0 CHEMBL288584,1 40,2 0.148,3 28,4 396.55,7 7.626,8 42.3,9 46.2,10 1,11 1.118,12 0.681,13 0.638,14 3.8,15 16,16 52,18 18,19 30,21 54,22 22,24 16,25 6,26 2,28 24,29 6,30 1,31 6.523}
{0 CHEMBL288814,1 40,2 0.148,3 28,4 396.55,7 7.626,8 42.3,9 46.2,10 1,11 1.118,12 0.681,13 0.638,14 3.8,15 16,16 52,18 18,19 30,21 54,22 22,24 16,25 6,26 2,28 24,29 6,30 1,31 6.237}
{0 CHEMBL288837,1 35,2 0.173,3 27,4 396.42,5 2,6 1,7 7.623,8 34.6,9 48.1,10 1.014,11 1.134,12 0.645,13 0.607,14 3.8,15 6,16 52,18 10,19 27,21 52,22 18,24 8,25 8,26 3,28 25,29 9,30 1,31 6.292}
{0 CHEMBL288911,1 50,2 0.138,3 34,4 472.65,7 7.623,8 45.2,9 45.2,10 0.996,11 1.112,12 0.692,13 0.649,14 3.2,15 22,16 62,18 24,19 37,21 65,22 28,24 22,25 6,26 2,28 28,29 6,30 1,31 6.959}
{0 CHEMBL289150,1 37,2 0.173,3 29,4 432.4,5 2,6 1,7 8.315,8 34.6,9 44.2,10 1.034,11 1.147,12 0.643,13 0.622,14 3.8,15 6,16 52,18 10,19 29,21 52,22 18,24 8,25 8,26 3,27 2,28 23,29 11,30 1,31 7.292}
{0 CHEMBL289223,1 47.5,2 0.131,3 32,4 446.61,7 7.7,8 44.8,9 44.8,10 0.998,11 1.113,12 0.692,13 0.65,14 3.4,15 21,16 58,18 23,19 35,21 61,22 26,24 20,25 6,26 2,28 26,29 6,30 1,31 6.222}
{0 CHEMBL289518,1 50,2 0.138,3 34,4 472.65,7 7.623,8 45.2,9 45.2,10 0.996,11 1.112,12 0.692,13 0.649,14 3.2,15 22,16 62,18 24,19 37,21 65,22 28,24 22,25 6,26 2,28 28,29 6,30 1,31 6.721}
{0 CHEMBL289638,1 40,2 0.157,3 29,4 422.4,5 2,6 1,7 8.448,8 40,9 42,10 1.025,11 1.136,12 0.675,13 0.648,14 4,15 12,16 50,18 15,19 30,21 51,22 20,24 13,25 5,26 2,27 2,28 21,29 9,30 1,31 6.959}
{0 CHEMBL290256,1 36,2 0.173,3 28,4 414.41,5 2,6 1,7 7.969,8 34.6,9 46.2,10 1.024,11 1.14,12 0.644,13 0.615,14 3.8,15 6,16 52,18 10,19 28,21 52,22 18,24 8,25 8,26 3,27 1,28 24,29 10,30 1,31 6.921}
{0 CHEMBL290287,1 44,2 0.169,3 33,4 482.46,5 2,6 1,7 8.318,8 37.9,9 43.1,10 1.029,11 1.139,12 0.659,13 0.636,14 3.4,15 12,16 58,18 15,19 34,21 59,22 22,24 13,25 7,26 2,27 2,28 25,29 11,30 1,31 6.796}
{0 CHEMBL290304,1 46,2 0.138,3 32,4 458.47,5 2,6 1,7 8.187,8 39.3,9 42.9,10 1.016,11 1.133,12 0.676,13 0.644,14 7.1,15 16,16 56,18 19,19 34,21 58,22 22,24 15,25 5,26 2,27 1,28 24,29 10,30 1,31 7.119}
{0 CHEMBL290332,1 41,2 0.167,3 30,4 436.43,5 2,6 1,7 8.235,8 39.6,9 43.4,10 1.021,11 1.136,12 0.67,13 0.64,14 3.8,15 12,16 53,18 15,19 31,21 54,22 21,24 13,25 6,26 2,27 2,28 23,29 9,30 1,31 6.824}
{0 CHEMBL290474,1 65,2 0.186,3 48,4 703.88,7 7.488,8 35.1,9 48.9,10 1.008,11 1.133,12 0.649,13 0.606,14 5.3,15 16,16 94,18 22,19 51,21 97,22 33,24 17,25 16,26 6,28 46,29 15,30 2,31 5}
{0 CHEMBL290492,1 43,2 0.119,3 30,4 422.59,7 7.546,8 42.9,9 46.4,10 0.998,11 1.117,12 0.681,13 0.637,14 3.6,15 16,16 56,18 18,19 33,21 59,22 24,24 16,25 8,26 2,28 26,29 6,30 1,31 6.523}
{0 CHEMBL290610,1 43,2 0.119,3 30,4 422.59,7 7.546,8 42.9,9 46.4,10 0.998,11 1.117,12 0.681,13 0.637,14 3.6,15 16,16 56,18 18,19 33,21 59,22 24,24 16,25 8,26 2,28 26,29 6,30 1,31 6.602}
{0 CHEMBL290698,1 36.5,2 0.156,3 25,4 359.36,7 8.357,8 37.2,9 41.9,10 1.015,11 1.134,12 0.684,13 0.648,14 11.6,15 17,16 43,18 18,19 27,21 45,22 16,24 13,25 3,26 1,28 18,29 9,30 1,31 6.387}
{0 CHEMBL290868,1 47.5,2 0.138,3 33,4 472.46,5 2,6 1,7 8.437,8 42.9,9 41.1,10 1.02,11 1.129,12 0.688,13 0.659,14 3.6,15 17,16 56,18 20,19 35,21 58,22 24,24 17,25 5,26 2,27 2,28 23,29 9,30 1,31 7.469}
{0 CHEMBL290944,1 53,2 0.164,3 38,4 541.59,7 7.737,8 38.6,9 45.7,10 1.012,11 1.127,12 0.661,13 0.627,14 4.3,15 16,16 70,18 20,19 41,21 73,22 27,24 17,25 10,26 4,28 32,29 11,30 1,31 6.377}
{0 CHEMBL291174,1 36,2 0.173,3 27,4 397.41,7 7.792,8 33.3,9 47.1,10 1.019,11 1.138,12 0.643,13 0.609,14 5.9,15 10,16 51,18 13,19 28,21 52,22 17,24 10,25 7,26 3,28 24,29 10,30 1,31 5.824}
{0 CHEMBL292044,1 43,2 0.145,3 32,4 456.61,7 7.61,8 40,9 46.7,10 1.007,11 1.123,12 0.664,13 0.628,14 3.3,15 12,16 60,18 15,19 34,21 62,22 24,24 15,25 9,26 3,28 28,29 8,30 1,31 6.699}
{0 CHEMBL292534,1 46,2 0.141,3 33,4 468.62,7 7.682,8 41,9 45.9,10 1.007,11 1.121,12 0.669,13 0.634,14 3.3,15 16,16 61,18 18,19 36,21 64,22 25,24 16,25 9,26 2,28 28,29 8,30 1,31 6.252}
{0 CHEMBL292733,1 45,2 0.157,3 34,4 482.7,7 7.099,8 39.7,9 50,10 0.996,11 1.123,12 0.657,13 0.611,14 2.9,15 12,16 68,18 15,19 36,21 70,22 27,24 15,25 12,26 3,28 34,29 7,30 1,31 7.268}
{0 CHEMBL292748,1 44,2 0.149,3 33,4 468.67,7 7.21,8 40,9 49.2,10 0.998,11 1.123,12 0.66,13 0.615,14 3.1,15 12,16 65,18 15,19 35,21 67,22 26,24 15,25 11,26 3,28 32,29 7,30 1,31 7.959}
{0 CHEMBL293024,1 44,2 0.154,3 33,4 470.64,7 7.47,8 39.7,9 47.6,10 1.005,11 1.123,12 0.66,13 0.622,14 3.2,15 12,16 63,18 15,19 35,21 65,22 25,24 15,25 10,26 3,28 30,29 8,30 1,31 7.959}
{0 CHEMBL293685,1 43,2 0.125,3 30,4 487.45,7 9.197,8 43.4,9 43.4,10 1.004,11 1.112,12 0.712,13 0.664,14 3.8,15 16,16 53,18 18,19 33,20 1,21 56,22 23,24 16,25 7,26 2,28 23,29 7,30 2,31 7.046}
{0 CHEMBL295451,1 64,2 0.149,3 45,4 631.72,7 7.611,8 41,9 45.8,10 1.006,11 1.122,12 0.67,13 0.632,14 3.6,15 22,16 83,18 26,19 49,21 87,22 34,24 23,25 11,26 4,28 38,29 11,30 1,31 6.796}
{0 CHEMBL295865,1 52,2 0.104,3 35,4 524.79,7 8.33,8 41.3,9 44.4,10 0.998,11 1.114,12 0.714,13 0.657,14 6.3,15 22,16 63,18 24,19 39,21 67,22 26,24 18,25 8,26 2,28 28,29 9,30 3,31 6.143}
{0 CHEMBL295909,1 49,2 0.086,3 32,4 482.7,7 8.939,8 42.6,9 40.7,10 1.005,11 1.109,12 0.736,13 0.682,14 7.4,15 22,16 54,18 24,19 36,21 58,22 23,24 18,25 5,26 2,28 22,29 9,30 3,31 6.301}
{0 CHEMBL296360,1 42.5,2 0.098,3 29,4 467.08,7 9.731,8 39.6,9 39.6,10 1.014,11 1.113,12 0.746,13 0.69,14 8.3,15 17,16 48,18 19,19 32,21 51,22 19,23 1,24 14,25 5,26 2,28 19,29 10,30 4,31 5.921}
{0 CHEMBL296371,1 42.5,2 0.098,3 29,4 450.63,7 9.388,8 39.6,9 39.6,10 1.018,11 1.122,12 0.727,13 0.681,14 8.3,15 17,16 48,18 19,19 32,21 51,22 19,24 14,25 5,26 2,27 1,28 19,29 10,30 3,31 5.048}
{0 CHEMBL296721,1 52,2 0.187,3 39,4 559.61,7 7.666,8 37,9 46.6,10 1.014,11 1.131,12 0.651,13 0.618,14 4.1,15 12,16 73,18 17,19 41,21 75,22 27,24 16,25 11,26 5,28 34,29 12,30 1,31 6}
{0 CHEMBL297792,1 50.5,2 0.109,3 32,4 464.6,5 2,6 1,7 8.935,8 46.2,9 38.5,10 1.012,11 1.104,12 0.73,13 0.693,14 3.8,15 21,16 52,18 25,19 35,21 55,22 24,24 19,25 3,26 3,28 20,29 8,30 2,31 6}
{0 CHEMBL298191,1 64,2 0.161,3 45,4 631.72,7 7.611,8 41,9 45.8,10 1.006,11 1.122,12 0.67,13 0.632,14 3.6,15 22,16 83,18 26,19 49,21 87,22 34,24 23,25 11,26 4,28 38,29 11,30 1,31 5}
{0 CHEMBL298647,1 23,2 0.071,3 17,4 255.68,7 9.47,8 37,9 37,10 1.042,11 1.138,12 0.677,13 0.672,14 11.1,15 6,16 27,18 8,19 18,21 28,22 10,23 1,24 8,25 2,26 2,28 10,29 7,30 1,31 5}
{0 CHEMBL298735,1 53,2 0.082,3 36,4 550.7,7 9.661,8 42.1,9 36.8,10 1.029,11 1.129,12 0.725,13 0.693,14 7,15 22,16 57,18 24,19 40,21 61,22 24,24 18,25 6,26 2,27 3,28 21,29 12,30 3,31 6.444}
{0 CHEMBL299074,1 51,2 0.098,3 34,4 514.72,7 9.03,8 42.1,9 40.4,10 1.011,11 1.117,12 0.727,13 0.679,14 7,15 22,16 57,18 24,19 38,21 61,22 24,24 18,25 6,26 2,27 1,28 23,29 10,30 3,31 6.824}
{0 CHEMBL299946,1 25,2 0.069,3 18,4 291.74,7 10.419,8 32.1,9 35.7,10 1.055,11 1.138,12 0.692,13 0.68,14 10.7,15 6,16 28,18 9,19 19,21 29,22 9,23 1,24 7,25 2,26 3,28 10,29 9,30 2,31 5}
{0 CHEMBL300855,1 51,2 0.086,3 34,4 535.13,7 9.91,8 42.6,9 37,10 1.02,11 1.115,12 0.75,13 0.704,14 7.4,15 22,16 54,18 24,19 38,21 58,22 23,23 1,24 18,25 5,26 2,27 1,28 20,29 11,30 4,31 5.921}
{0 CHEMBL301646,1 43,2 0.125,3 30,4 487.45,7 9.197,8 43.4,9 43.4,10 1.004,11 1.112,12 0.712,13 0.664,14 3.8,15 16,16 53,18 18,19 33,20 1,21 56,22 23,24 16,25 7,26 2,28 23,29 7,30 2,31 7.745}
{0 CHEMBL302258,1 25.5,2 0.138,3 18,4 266.3,7 9.511,8 39.3,9 35.7,10 1.04,11 1.122,12 0.697,13 0.686,14 7.1,15 11,16 28,18 12,19 19,21 29,22 11,24 9,25 2,26 1,28 10,29 7,30 1,31 5.367}
{0 CHEMBL302383,1 38,2 0.153,3 30,4 420.52,7 7.25,8 34.5,9 48.3,10 1.017,11 1.142,12 0.619,13 0.598,14 6.9,15 6,16 58,18 10,19 31,21 59,22 20,24 10,25 10,26 4,28 28,29 10,31 4.481}
{0 CHEMBL302837,1 43,2 0.125,3 30,4 487.45,7 9.197,8 43.4,9 43.4,10 1.004,11 1.112,12 0.712,13 0.664,14 3.8,15 16,16 53,18 18,19 33,20 1,21 56,22 23,24 16,25 7,26 2,28 23,29 7,30 2,31 7.509}
{0 CHEMBL302912,1 45,2 0.143,3 34,4 482.7,7 7.099,8 39.7,9 50,10 0.996,11 1.123,12 0.657,13 0.611,14 2.9,15 12,16 68,18 15,19 36,21 70,22 27,24 15,25 12,26 3,28 34,29 7,30 1,31 6.921}
{0 CHEMBL302985,1 26.5,2 0.118,3 19,4 262.29,7 7.948,8 39.4,9 42.4,10 1.025,11 1.131,12 0.648,13 0.638,14 6.1,15 11,16 33,18 12,19 20,21 34,22 13,24 10,25 3,26 1,28 14,29 6,31 4.301}
{0 CHEMBL303159,1 35,2 0.16,3 26,4 361.44,7 7.376,8 36.7,9 46.9,10 1.016,11 1.137,12 0.631,13 0.61,14 6.1,15 10,16 49,18 13,19 27,21 50,22 18,24 11,25 7,26 3,28 23,29 8,31 9.602}
{0 CHEMBL303302,1 44,2 0.133,3 31,4 438.59,7 7.695,8 42.1,9 45.6,10 1.003,11 1.118,12 0.677,13 0.639,14 3.5,15 16,16 57,18 18,19 34,21 60,22 24,24 16,25 8,26 2,28 26,29 7,30 1,31 7.102}
{0 CHEMBL303570,1 44,2 0.149,3 33,4 468.67,7 7.21,8 40,9 49.2,10 0.998,11 1.123,12 0.66,13 0.615,14 3.1,15 12,16 65,18 15,19 35,21 67,22 26,24 15,25 11,26 3,28 32,29 7,30 1,31 6.62}
{0 CHEMBL303775,1 45,2 0.143,3 34,4 482.7,7 7.099,8 39.7,9 50,10 0.996,11 1.123,12 0.657,13 0.611,14 2.9,15 12,16 68,18 15,19 36,21 70,22 27,24 15,25 12,26 3,28 34,29 7,30 1,31 6.678}
{0 CHEMBL303858,1 33.5,2 0.111,3 22,4 312.37,7 9.187,8 47.1,9 35.3,10 1.02,11 1.106,12 0.73,13 0.706,14 5.9,15 17,16 34,18 18,19 24,21 36,22 16,24 15,25 1,26 1,28 12,29 6,30 1,31 5.886}
{0 CHEMBL303892,1 35,2 0.157,3 26,4 360.46,7 7.209,8 36,9 48,10 1.011,11 1.14,12 0.629,13 0.604,14 8,15 10,16 50,18 13,19 27,21 51,22 18,24 11,25 7,26 3,28 24,29 8,31 8.319}
{0 CHEMBL304209,1 43,2 0.125,3 30,4 487.45,7 9.197,8 43.4,9 43.4,10 1.004,11 1.112,12 0.712,13 0.664,14 3.8,15 16,16 53,18 18,19 33,20 1,21 56,22 23,24 16,25 7,26 2,28 23,29 7,30 2,31 6.959}
{0 CHEMBL304218,1 45,2 0.143,3 32,4 452.62,7 7.544,8 41.7,9 46.7,10 1.001,11 1.119,12 0.673,13 0.632,14 3.3,15 16,16 60,18 18,19 35,21 63,22 25,24 16,25 9,26 2,28 28,29 7,30 1,31 7.328}
{0 CHEMBL304408,1 45,2 0.157,3 34,4 482.7,7 7.099,8 39.7,9 50,10 0.996,11 1.123,12 0.657,13 0.611,14 2.9,15 12,16 68,18 15,19 36,21 70,22 27,24 15,25 12,26 3,28 34,29 7,30 1,31 6.77}
{0 CHEMBL304496,1 20,2 0.216,3 18,4 260.34,7 6.851,8 26.3,9 52.6,10 1.021,11 1.162,12 0.577,13 0.557,14 10.5,16 38,18 3,19 17,21 37,22 10,24 3,25 7,26 3,28 20,29 8,31 5}
{0 CHEMBL304629,1 44,2 0.133,3 31,4 438.59,7 7.695,8 42.1,9 45.6,10 1.003,11 1.118,12 0.677,13 0.639,14 3.5,15 16,16 57,18 18,19 34,21 60,22 24,24 16,25 8,26 2,28 26,29 7,30 1,31 7}
{0 CHEMBL304736,1 34,2 0.208,3 27,4 378.48,7 7.141,8 34,9 49.1,10 1.014,11 1.144,12 0.616,13 0.593,14 7.5,15 6,16 53,18 10,19 27,21 53,22 18,24 10,25 8,26 4,28 26,29 9,31 5}
{0 CHEMBL304939,1 22,2 0.2,3 19,4 275.3,7 7.647,8 27.8,9 47.2,10 1.04,11 1.157,12 0.585,13 0.584,14 8.3,16 36,18 4,19 18,21 35,22 10,24 4,25 6,26 4,28 17,29 9,31 8.523}
{0 CHEMBL305089,1 44,2 0.133,3 31,4 438.59,7 7.695,8 42.1,9 45.6,10 1.003,11 1.118,12 0.677,13 0.639,14 3.5,15 16,16 57,18 18,19 34,21 60,22 24,24 16,25 8,26 2,28 26,29 7,30 1,31 7.658}
{0 CHEMBL305388,1 44,2 0.133,3 31,4 438.59,7 7.695,8 42.1,9 45.6,10 1.003,11 1.118,12 0.677,13 0.639,14 3.5,15 16,16 57,18 18,19 34,21 60,22 24,24 16,25 8,26 2,28 26,29 7,30 1,31 6.745}
{0 CHEMBL308333,1 30,2 0.177,3 27,4 385.57,7 6.219,8 30.6,9 56.5,10 1.001,11 1.148,12 0.588,13 0.549,14 4.8,16 62,18 3,19 27,21 62,22 19,24 3,25 16,26 3,28 35,29 8,31 5.398}
{0 CHEMBL317472,1 43.5,2 0.152,3 33,4 489.72,7 7.652,8 37.5,9 48.4,10 1.002,11 1.125,12 0.669,13 0.62,14 4.7,15 11,16 64,18 14,19 35,21 66,22 24,24 12,25 12,26 3,28 31,29 9,30 2,31 8.022}
{0 CHEMBL319463,1 47.5,2 0.135,3 36,4 529.79,7 7.462,8 38,9 49.3,10 0.999,11 1.124,12 0.666,13 0.616,14 4.2,15 11,16 71,18 14,19 39,21 74,22 27,24 12,25 15,26 3,28 35,29 9,30 2,31 7.638}
{0 CHEMBL319708,1 44,2 0.138,3 33,4 470.65,7 7.471,8 38.1,9 47.6,10 1.004,11 1.129,12 0.657,13 0.619,14 6.3,15 12,16 63,18 15,19 35,21 65,22 24,24 13,25 11,26 3,28 30,29 9,30 1,31 6.921}
{0 CHEMBL320400,1 42.5,2 0.143,3 32,4 475.69,7 7.798,8 37.7,9 47.5,10 1.004,11 1.124,12 0.673,13 0.625,14 4.9,15 11,16 61,18 14,19 34,21 63,22 23,24 12,25 11,26 3,28 29,29 9,30 2,31 7.31}
{0 CHEMBL320471,1 49,2 0.147,3 36,4 514.66,7 7.798,8 37.9,9 45.5,10 1.014,11 1.13,12 0.656,13 0.627,14 6.1,15 12,16 66,18 17,19 38,21 68,22 25,24 14,25 11,26 5,28 30,29 11,30 1,31 7.009}
{0 CHEMBL330896,1 42.5,2 0.141,3 32,4 474.7,7 7.656,8 38.7,9 48.4,10 1.001,11 1.121,12 0.674,13 0.623,14 3.2,15 11,16 62,18 14,19 34,21 64,22 24,24 13,25 11,26 3,28 30,29 8,30 2,31 6.886}
{0 CHEMBL331080,1 48,2 0.147,3 37,4 528.73,7 7.243,8 38.4,9 49.3,10 1.004,11 1.126,12 0.648,13 0.609,14 2.7,15 12,16 73,18 15,19 39,21 75,22 28,24 15,25 13,26 3,28 36,29 9,30 1,31 6.456}
{0 CHEMBL331531,1 46,2 0.134,3 35,4 521.1,7 8.017,8 40,9 46.2,10 1.01,11 1.127,12 0.672,13 0.634,14 3.1,15 12,16 65,18 15,19 37,21 67,22 26,23 1,24 15,25 11,26 3,27 1,28 30,29 9,30 2,31 6.252}
{0 CHEMBL342077,1 36.5,2 0.133,3 25,4 363.33,7 8.45,8 39.5,9 41.9,10 1.023,11 1.121,12 0.681,13 0.651,14 2.3,15 15,16 43,18 17,19 27,21 45,22 17,24 13,25 4,26 2,28 18,29 8,30 1,31 6.745}
{0 CHEMBL342962,1 53.5,2 0.169,3 38,4 543.55,7 7.993,8 39.7,9 44.1,10 1.019,11 1.123,12 0.665,13 0.636,14 1.5,15 21,16 68,18 23,19 41,21 71,22 27,24 19,25 8,26 2,28 30,29 11,30 1,31 7.658}
{0 CHEMBL343904,1 38.5,2 0.128,3 26,4 371.37,7 8.44,8 38.6,9 40.9,10 1.015,11 1.131,12 0.691,13 0.656,14 11.4,15 17,16 44,18 18,19 29,21 47,22 17,24 13,25 4,26 1,28 18,29 9,30 1,31 6.284}
{0 CHEMBL345200,1 46.5,2 0.132,3 30,4 440.58,7 8.812,8 44,9 40,10 1.012,11 1.108,12 0.72,13 0.68,14 4,15 21,16 50,18 24,19 33,21 53,22 22,24 19,25 3,26 3,28 20,29 8,30 2,31 6}
{0 CHEMBL345597,1 55.5,2 0.136,3 35,4 488.57,7 8.883,8 43.6,9 36.4,10 1.021,11 1.121,12 0.706,13 0.688,14 10.9,15 27,16 55,18 30,19 39,21 59,22 24,24 22,25 2,26 3,28 20,29 11,30 1,31 6}
{0 CHEMBL345878,1 54,2 0.108,3 37,4 511.74,7 7.311,8 44.3,9 47.1,10 0.99,11 1.115,12 0.686,13 0.637,14 4.3,15 22,16 70,18 24,19 41,21 74,22 31,24 22,25 9,26 2,28 33,29 6,30 1,31 5.187}
{0 CHEMBL346494,1 46,2 0.15,3 31,4 430.61,7 7.555,8 45.6,9 45.6,10 0.992,11 1.111,12 0.697,13 0.649,14 3.5,15 22,16 57,18 23,19 34,21 60,22 26,24 21,25 5,26 1,28 26,29 5,30 1,31 5.187}
{0 CHEMBL34668,1 35.5,2 0.143,3 24,4 349.3,7 8.732,8 40,9 40,10 1.028,11 1.12,12 0.688,13 0.661,14 2.5,15 15,16 40,18 17,19 26,21 42,22 16,24 13,25 3,26 2,28 16,29 8,30 1,31 7.658}
{0 CHEMBL34876,1 48,2 0.136,3 32,4 444.59,7 7.939,8 46.4,9 42.9,10 1,11 1.109,12 0.704,13 0.664,14 3.6,15 22,16 56,18 24,19 35,21 59,22 26,24 22,25 4,26 2,28 24,29 6,30 1,31 5.382}
{0 CHEMBL35643,1 42,2 0.125,3 29,4 408.56,7 7.709,8 43.4,9 45.3,10 1,11 1.115,12 0.687,13 0.645,14 3.8,15 16,16 53,18 18,19 32,21 56,22 23,24 16,25 7,26 2,28 24,29 6,30 1,31 7}
{0 CHEMBL357226,1 44.5,2 0.164,3 32,4 462.48,7 7.839,8 37.3,9 45.8,10 1.016,11 1.129,12 0.657,13 0.624,14 3.4,15 15,16 59,18 18,19 34,21 61,22 22,24 14,25 8,26 3,28 27,29 10,30 1,31 7.886}
{0 CHEMBL357251,1 55,2 0.136,3 36,4 503.52,7 8.121,8 45.2,9 41.9,10 1.009,11 1.111,12 0.699,13 0.663,14 1.6,15 26,16 62,18 28,19 40,21 66,22 28,24 23,25 5,26 2,28 26,29 8,30 1,31 5.745}
{0 CHEMBL357441,1 51.5,2 0.164,3 36,4 513.52,7 8.024,8 40.6,9 43.8,10 1.017,11 1.12,12 0.672,13 0.641,14 1.6,15 21,16 64,18 23,19 39,21 67,22 26,24 19,25 7,26 2,28 28,29 10,30 1,31 6.051}
{0 CHEMBL35749,1 43,2 0.119,3 30,4 422.59,7 7.546,8 42.9,9 46.4,10 0.998,11 1.117,12 0.681,13 0.637,14 3.6,15 16,16 56,18 18,19 33,21 59,22 24,24 16,25 8,26 2,28 26,29 6,30 1,31 6.721}
{0 CHEMBL358098,1 53.5,2 0.169,3 38,4 543.55,7 7.993,8 39.7,9 44.1,10 1.019,11 1.123,12 0.665,13 0.636,14 1.5,15 21,16 68,18 23,19 41,21 71,22 27,24 19,25 8,26 2,28 30,29 11,30 1,31 6.284}
{0 CHEMBL358774,1 53.5,2 0.169,3 38,4 543.55,7 7.993,8 39.7,9 44.1,10 1.019,11 1.123,12 0.665,13 0.636,14 1.5,15 21,16 68,18 23,19 41,21 71,22 27,24 19,25 8,26 2,28 30,29 11,30 1,31 7.398}
{0 CHEMBL359024,1 55,2 0.138,3 36,4 504.51,7 8.271,8 44.3,9 41,10 1.012,11 1.114,12 0.698,13 0.665,14 3.3,15 26,16 61,18 28,19 40,21 65,22 27,24 22,25 5,26 2,28 25,29 9,30 1,31 6.699}
{0 CHEMBL35995,1 47,2 0.138,3 33,4 476.46,5 2,6 1,7 8.508,8 39.3,9 41.1,10 1.026,11 1.139,12 0.675,13 0.651,14 7.1,15 16,16 56,18 19,19 35,21 58,22 22,24 15,25 5,26 2,27 2,28 23,29 11,30 1,31 6.955}
{0 CHEMBL363349,1 50,2 0.108,3 34,4 457.59,7 7.38,8 45.2,9 45.2,10 0.999,11 1.123,12 0.674,13 0.641,14 4.8,15 22,16 62,18 24,19 37,21 65,22 28,24 22,25 6,26 2,27 1,28 28,29 6,31 5}
{0 CHEMBL36382,1 35,2 0.163,3 27,4 400.38,5 2,6 1,7 8.171,8 34.7,9 44.9,10 1.028,11 1.14,12 0.648,13 0.621,14 4.1,15 6,16 49,18 10,19 27,21 49,22 17,24 8,25 7,26 3,27 1,28 22,29 10,30 1,31 6.959}
{0 CHEMBL366245,1 70,2 0.116,3 47,4 654.82,7 7.986,8 43.9,9 42.7,10 1.009,11 1.121,12 0.684,13 0.654,14 4.9,15 28,16 82,18 33,19 51,21 86,22 36,24 29,25 7,26 5,27 1,28 35,29 11,30 1,31 6.921}
{0 CHEMBL367315,1 24,2 0.031,3 17,4 231.27,7 7.709,8 43.3,9 43.3,10 1.013,11 1.121,12 0.665,13 0.644,14 3.3,15 6,16 30,18 8,19 19,21 32,22 13,24 9,25 4,26 2,28 13,29 4,31 7.548}
{0 CHEMBL36753,1 36,2 0.2,3 28,4 432.45,5 2,6 1,7 8.649,8 34,9 44,10 1.029,11 1.136,12 0.668,13 0.632,14 4,15 6,16 50,18 10,19 28,21 50,22 17,24 8,25 7,26 3,27 1,28 22,29 11,30 2,31 6.638}
{0 CHEMBL36809,1 46.5,2 0.138,3 32,4 454.47,5 2,6 1,7 8.116,8 42.9,9 42.9,10 1.011,11 1.123,12 0.689,13 0.652,14 3.6,15 17,16 56,18 20,19 34,21 58,22 24,24 17,25 5,26 2,27 1,28 24,29 8,30 1,31 6.886}
{0 CHEMBL370003,1 55,2 0.113,3 38,4 515.64,7 7.583,8 42.6,9 44.1,10 1.007,11 1.13,12 0.665,13 0.639,14 7.4,15 22,16 68,18 25,19 41,21 71,22 29,24 22,25 7,26 3,27 1,28 30,29 9,31 6.886}
{0 CHEMBL370084,1 53,2 0.103,3 37,4 507.6,7 7.809,8 44.6,9 43.1,10 1.013,11 1.135,12 0.668,13 0.646,14 4.6,15 22,16 65,18 24,19 40,21 68,22 29,24 22,25 7,26 2,27 3,28 28,29 8,31 6.77}
{0 CHEMBL37052,1 53,2 0.154,3 37,4 524.52,5 2,6 1,7 8.326,8 42.9,9 41.3,10 1.018,11 1.122,12 0.687,13 0.659,14 3.2,15 18,16 63,18 22,19 39,21 65,22 27,24 20,25 5,26 3,27 1,28 26,29 10,30 1,31 7.886}
{0 CHEMBL370766,1 68,2 0.118,3 46,4 638.82,7 7.887,8 44.4,9 43.2,10 1.005,11 1.12,12 0.687,13 0.654,14 4.9,15 28,16 81,18 32,19 50,21 85,22 36,24 29,25 7,26 4,27 1,28 35,29 10,30 1,31 7.18}
{0 CHEMBL37078,1 47.5,2 0.138,3 33,4 472.46,5 2,6 1,7 8.437,8 42.9,9 41.1,10 1.02,11 1.129,12 0.688,13 0.659,14 3.6,15 17,16 56,18 20,19 35,21 58,22 24,24 17,25 5,26 2,27 2,28 23,29 9,30 1,31 7.276}
{0 CHEMBL37276,1 43,2 0.119,3 30,4 422.59,7 7.546,8 42.9,9 46.4,10 0.998,11 1.117,12 0.681,13 0.637,14 3.6,15 16,16 56,18 18,19 33,21 59,22 24,24 16,25 8,26 2,28 26,29 6,30 1,31 6.174}
{0 CHEMBL37456,1 40,2 0.16,3 29,4 423.39,5 2,6 1,7 8.641,8 38.8,9 40.8,10 1.03,11 1.141,12 0.674,13 0.651,14 6.1,15 12,16 49,18 15,19 30,21 50,22 19,24 12,25 5,26 2,27 2,28 20,29 10,30 1,31 6.509}
{0 CHEMBL37542,1 43,2 0.167,3 31,4 448.42,5 2,6 1,7 8.461,8 39.6,9 41.5,10 1.026,11 1.13,12 0.674,13 0.65,14 3.8,15 12,16 53,18 16,19 32,21 54,22 21,24 14,25 5,26 3,27 1,28 22,29 10,30 1,31 7.252}
{0 CHEMBL37596,1 49,2 0.145,3 33,4 458.62,7 7.773,8 45.8,9 44.1,10 0.998,11 1.111,12 0.698,13 0.656,14 3.4,15 22,16 59,18 24,19 36,21 62,22 27,24 22,25 5,26 2,28 26,29 6,30 1,31 5}
{0 CHEMBL37711,1 50,2 0.138,3 34,4 472.65,7 7.623,8 45.2,9 45.2,10 0.996,11 1.112,12 0.692,13 0.649,14 3.2,15 22,16 62,18 24,19 37,21 65,22 28,24 22,25 6,26 2,28 28,29 6,30 1,31 6.036}
{0 CHEMBL37841,1 50,2 0.138,3 34,4 472.65,7 7.623,8 45.2,9 45.2,10 0.996,11 1.112,12 0.692,13 0.649,14 3.2,15 22,16 62,18 24,19 37,21 65,22 28,24 22,25 6,26 2,28 28,29 6,30 1,31 6.87}
{0 CHEMBL37861,1 38,2 0.146,3 27,4 390.38,5 2,6 1,7 8.306,8 40.4,9 42.6,10 1.018,11 1.129,12 0.682,13 0.648,14 4.3,15 12,16 47,18 15,19 28,21 48,22 19,24 13,25 4,26 2,27 1,28 20,29 8,30 1,31 6.602}
{0 CHEMBL378762,1 27.5,2 0.152,3 22,4 325.48,7 7.233,8 33.3,9 51.1,10 1.004,11 1.138,12 0.636,13 0.593,14 6.7,15 5,16 45,18 7,19 23,21 46,22 15,24 4,25 11,26 2,28 23,29 7,30 1,31 5.523}
{0 CHEMBL378763,1 28.5,2 0.163,3 23,4 339.51,7 7.073,8 33.3,9 52.1,10 1.002,11 1.138,12 0.633,13 0.587,14 6.3,15 5,16 48,18 7,19 24,21 49,22 16,24 4,25 12,26 2,28 25,29 7,30 1,31 5.523}
{0 CHEMBL38075,1 40,2 0.148,3 28,4 396.55,7 7.626,8 42.3,9 46.2,10 1,11 1.118,12 0.681,13 0.638,14 3.8,15 16,16 52,18 18,19 30,21 54,22 22,24 16,25 6,26 2,28 24,29 6,30 1,31 7}
{0 CHEMBL381023,1 54,2 0.116,3 37,4 500.62,7 7.585,8 43.9,9 43.9,10 1.006,11 1.127,12 0.67,13 0.643,14 6.1,15 22,16 66,18 25,19 40,21 69,22 29,24 23,25 6,26 3,27 1,28 29,29 8,31 6.658}
{0 CHEMBL381643,1 70,2 0.118,3 47,4 655.81,7 8.096,8 43.2,9 42,10 1.012,11 1.124,12 0.683,13 0.656,14 6.2,15 28,16 81,18 33,19 51,21 85,22 35,24 29,25 6,26 5,27 1,28 34,29 12,30 1,31 7.409}
{0 CHEMBL381863,1 48,2 0.097,3 32,4 425.57,7 7.213,8 45.8,9 45.8,10 0.993,11 1.117,12 0.679,13 0.641,14 5.1,15 22,16 59,18 24,19 35,21 62,22 27,24 22,25 5,26 2,28 27,29 5,31 5.229}
{0 CHEMBL38235,1 47.5,2 0.131,3 32,4 446.61,7 7.7,8 44.8,9 44.8,10 0.998,11 1.113,12 0.692,13 0.65,14 3.4,15 21,16 58,18 23,19 35,21 61,22 26,24 20,25 6,26 2,28 26,29 6,30 1,31 6.009}
{0 CHEMBL38249,1 40,2 0.148,3 28,4 396.55,7 7.626,8 42.3,9 46.2,10 1,11 1.118,12 0.681,13 0.638,14 3.8,15 16,16 52,18 18,19 30,21 54,22 22,24 16,25 6,26 2,28 24,29 6,30 1,31 6.108}
{0 CHEMBL39384,1 30.5,2 0.139,3 21,4 307.28,5 2,6 1,7 8.779,8 34.3,9 40,10 1.025,11 1.141,12 0.682,13 0.652,14 14.3,15 11,16 35,18 13,19 22,21 36,22 12,24 7,25 3,26 1,28 14,29 9,30 1,31 6.229}
{0 CHEMBL39714,1 49,2 0.145,3 34,4 480.51,5 2,6 1,7 8.008,8 43.3,9 43.3,10 1.008,11 1.122,12 0.689,13 0.651,14 3.3,15 18,16 60,18 21,19 36,21 62,22 26,24 19,25 5,26 2,27 1,28 26,29 8,30 1,31 7.481}
{0 CHEMBL39777,1 48,2 0.143,3 34,4 490.43,5 4,6 2,7 8.917,8 41.8,9 38.2,10 1.034,11 1.131,12 0.685,13 0.669,14 3.6,15 12,16 55,18 17,19 35,21 56,22 23,24 14,25 5,26 3,27 2,28 21,29 11,30 1,31 7.553}
{0 CHEMBL39812,1 28,2 0.152,3 21,4 319.22,5 2,6 1,7 9.673,8 36.4,9 36.4,10 1.058,11 1.147,12 0.672,13 0.666,14 3,15 6,16 33,18 9,19 21,21 33,22 12,24 7,25 3,26 2,27 2,28 12,29 9,30 1,31 6.77}
{0 CHEMBL39828,1 41,2 0.15,3 32,4 472.47,5 2,6 1,7 8.008,8 35.6,9 45.8,10 1.026,11 1.144,12 0.643,13 0.617,14 3.4,15 6,16 59,18 10,19 33,21 60,22 21,24 8,25 11,26 3,27 2,28 27,29 11,30 1,31 7.854}
{0 CHEMBL39887,1 50.5,2 0.148,3 35,4 498.48,5 2,6 1,7 8.449,8 42.4,9 40.7,10 1.021,11 1.124,12 0.686,13 0.66,14 3.4,15 17,16 59,18 21,19 37,21 61,22 25,24 18,25 5,26 3,27 1,28 24,29 10,30 1,31 7.602}
{0 CHEMBL39997,1 39,2 0.157,3 28,4 404.41,5 2,6 1,7 8.088,8 40,9 44,10 1.014,11 1.129,12 0.676,13 0.64,14 4,15 12,16 50,18 15,19 29,21 51,22 20,24 13,25 5,26 2,27 1,28 22,29 8,30 1,31 6.638}
{0 CHEMBL40028,1 31.5,2 0.139,3 22,4 325.27,5 2,6 1,7 9.293,8 34.3,9 37.1,10 1.04,11 1.15,12 0.681,13 0.663,14 14.3,15 11,16 35,18 13,19 23,21 36,22 12,24 7,25 3,26 1,27 1,28 13,29 10,30 1,31 6.824}
{0 CHEMBL40161,1 36,2 0.173,3 28,4 430.86,5 2,6 1,7 8.286,8 34.6,9 46.2,10 1.021,11 1.133,12 0.662,13 0.623,14 3.8,15 6,16 52,18 10,19 28,21 52,22 18,23 1,24 8,25 8,26 3,28 24,29 10,30 2,31 5.367}
{0 CHEMBL40168,1 50,2 0.145,3 35,4 498.5,5 2,6 1,7 8.308,8 43.3,9 41.7,10 1.017,11 1.127,12 0.688,13 0.657,14 3.3,15 18,16 60,18 21,19 37,21 62,22 26,24 19,25 5,26 2,27 2,28 25,29 9,30 1,31 7.553}
{0 CHEMBL40578,1 53,2 0.147,3 38,4 539.62,7 7.495,8 38.9,9 47.2,10 1.005,11 1.127,12 0.661,13 0.621,14 4.2,15 16,16 72,18 20,19 41,21 75,22 28,24 17,25 11,26 4,28 34,29 10,30 1,31 6.222}
{0 CHEMBL41228,1 24,2 0.19,3 21,4 302.38,7 7.032,8 27.9,9 51.2,10 1.023,11 1.158,12 0.585,13 0.567,14 9.3,16 43,18 4,19 20,21 42,22 12,24 4,25 8,26 4,28 22,29 9,31 7.959}
{0 CHEMBL413724,1 51.5,2 0.159,3 35,4 496.49,7 8.275,8 41.7,9 41.7,10 1.018,11 1.119,12 0.684,13 0.655,14 3.3,15 21,16 60,18 24,19 38,21 63,22 25,24 20,25 5,26 3,28 25,29 10,30 1,31 7.638}
{0 CHEMBL415967,1 55,2 0.136,3 36,4 499.55,7 8.057,8 43.5,9 41.9,10 1.003,11 1.12,12 0.701,13 0.661,14 8.1,15 28,16 62,18 29,19 40,21 66,22 27,24 23,25 4,26 1,28 26,29 9,30 1,31 4.699}
{0 CHEMBL416234,1 41,2 0.157,3 30,4 501.29,5 2,6 1,7 10.026,8 40,9 40,10 1.029,11 1.133,12 0.702,13 0.668,14 4,15 12,16 50,18 15,19 31,20 1,21 51,22 20,24 13,25 5,26 2,27 2,28 20,29 10,30 2,31 7.367}
{0 CHEMBL417507,1 40,2 0.157,3 29,4 483.3,5 2,6 1,7 9.666,8 40,9 42,10 1.019,11 1.126,12 0.704,13 0.661,14 4,15 12,16 50,18 15,19 30,20 1,21 51,22 20,24 13,25 5,26 2,27 1,28 21,29 9,30 2,31 6.959}
{0 CHEMBL417721,1 41.5,2 0.077,3 29,4 429.59,7 8.767,8 40.8,9 40.8,10 1.012,11 1.127,12 0.71,13 0.669,14 10.2,15 17,16 49,18 18,19 32,21 52,22 20,24 15,25 5,26 1,27 1,28 20,29 9,30 2,31 4.752}
{0 CHEMBL418704,1 47.5,2 0.153,3 32,4 449.49,7 8.027,8 41.1,9 42.9,10 1.005,11 1.125,12 0.691,13 0.651,14 8.9,15 23,16 56,18 24,19 35,21 59,22 23,24 19,25 4,26 1,28 24,29 9,30 1,31 5.301}
{0 CHEMBL419170,1 42.5,2 0.143,3 32,4 459.62,7 7.535,8 37.7,9 47.5,10 1.008,11 1.129,12 0.653,13 0.618,14 4.9,15 11,16 61,18 14,19 34,21 63,22 23,24 12,25 11,26 3,28 29,29 9,30 1,31 7.409}
{0 CHEMBL419725,1 49,2 0.137,3 37,4 526.72,7 7.419,8 38,9 47.9,10 1.005,11 1.129,12 0.653,13 0.616,14 5.6,15 12,16 71,18 16,19 39,21 73,22 27,24 15,25 12,26 4,28 34,29 10,30 1,31 6.886}
{0 CHEMBL420915,1 44,2 0.136,3 33,4 469.66,7 7.338,8 39.1,9 48.4,10 1.001,11 1.126,12 0.658,13 0.617,14 4.7,15 12,16 64,18 15,19 35,21 66,22 25,24 14,25 11,26 3,28 31,29 8,30 1,31 6.658}
{0 CHEMBL421021,1 43.5,2 0.167,3 33,4 489.72,7 7.652,8 37.5,9 48.4,10 1.002,11 1.125,12 0.669,13 0.62,14 4.7,15 11,16 64,18 14,19 35,21 66,22 24,24 12,25 12,26 3,28 31,29 9,30 2,31 7.62}
{0 CHEMBL421586,1 44,2 0.138,3 33,4 470.65,7 7.471,8 38.1,9 47.6,10 1.004,11 1.129,12 0.657,13 0.619,14 6.3,15 12,16 63,18 15,19 35,21 65,22 24,24 13,25 11,26 3,28 30,29 9,30 1,31 7.387}
{0 CHEMBL421819,1 27,2 0.139,3 19,4 272.4,7 7.783,8 42.9,9 45.7,10 0.994,11 1.115,12 0.698,13 0.647,14 5.7,15 12,16 35,18 13,19 20,21 36,22 15,24 12,25 3,26 1,28 16,29 4,30 1,31 5.108}
{0 CHEMBL42284,1 59,2 0.169,3 43,4 608.68,7 7.608,8 40,9 46.3,10 1.009,11 1.123,12 0.663,13 0.627,14 2.5,15 18,16 80,18 22,19 46,21 83,22 32,24 21,25 11,26 4,28 37,29 11,30 1,31 6.921}
{0 CHEMBL42344,1 80,2 0.193,3 58,4 838.02,7 7.618,8 37.3,9 47.3,10 1.009,11 1.129,12 0.656,13 0.618,14 4.5,15 22,16 110,18 29,19 62,21 114,22 41,24 24,25 17,26 7,28 52,29 17,30 2,31 5}
{0 CHEMBL423751,1 51.5,2 0.164,3 36,4 513.52,7 8.024,8 40.6,9 43.8,10 1.017,11 1.12,12 0.672,13 0.641,14 1.6,15 21,16 64,18 23,19 39,21 67,22 26,24 19,25 7,26 2,28 28,29 10,30 1,31 6.959}
{0 CHEMBL424591,1 56,2 0.185,3 41,4 579.69,7 7.338,8 39.2,9 48.1,10 1.002,11 1.126,12 0.66,13 0.617,14 3.8,15 18,16 79,18 22,19 43,21 81,22 31,24 21,25 10,26 4,28 38,29 10,30 1,31 4.699}
{0 CHEMBL425383,1 50.5,2 0.097,3 34,4 519.72,7 8.809,8 39,9 42.4,10 1.015,11 1.116,12 0.705,13 0.661,14 5.1,15 17,16 59,18 22,19 37,21 62,22 23,24 17,25 6,26 5,28 25,29 11,30 3,31 5.597}
{0 CHEMBL42551,1 56,2 0.143,3 41,4 581.71,7 7.182,8 38.3,9 49.4,10 1,11 1.128,12 0.653,13 0.608,14 3.7,15 16,16 81,18 20,19 44,21 84,22 31,24 17,25 14,26 4,28 40,29 10,30 1,31 6.26}
{0 CHEMBL42583,1 50,2 0.21,3 40,4 584.77,7 7.31,8 32.5,9 50,10 1.017,11 1.141,12 0.618,13 0.59,14 5,15 6,16 80,18 12,19 41,21 81,22 26,24 10,25 16,26 6,28 40,29 14,30 1,31 5.824}
{0 CHEMBL425910,1 55,2 0.097,3 37,4 495.64,7 7.398,8 46.3,9 44.8,10 0.998,11 1.12,12 0.679,13 0.646,14 4.5,15 22,16 67,18 24,19 42,21 72,22 31,24 22,25 9,26 2,27 1,28 30,29 6,31 6.523}
{0 CHEMBL42619,1 80,2 0.193,3 58,4 838.02,7 7.618,8 37.3,9 47.3,10 1.009,11 1.129,12 0.656,13 0.618,14 4.5,15 22,16 110,18 29,19 62,21 114,22 41,24 24,25 17,26 7,28 52,29 17,30 2,31 7.222}
{0 CHEMBL426471,1 50,2 0.109,3 34,4 458.58,7 7.518,8 44.3,9 44.3,10 1.003,11 1.127,12 0.672,13 0.643,14 6.6,15 22,16 61,18 24,19 37,21 64,22 27,24 21,25 6,26 2,27 1,28 27,29 7,31 6.071}
{0 CHEMBL427799,1 72,2 0.198,3 53,4 747.91,7 7.261,8 37.9,9 48.5,10 1.004,11 1.13,12 0.649,13 0.61,14 4.9,15 22,16 103,18 27,19 56,21 106,22 39,24 24,25 15,26 5,28 50,29 14,30 1,31 6.602}
{0 CHEMBL43114,1 67,2 0.153,3 46,4 646.69,7 7.984,8 40.7,9 43.2,10 1.014,11 1.124,12 0.673,13 0.644,14 4.9,15 22,16 81,18 28,19 50,21 85,22 33,24 23,25 10,26 6,28 35,29 13,30 1,31 7.301}
{0 CHEMBL431355,1 42.5,2 0.093,3 29,4 446.67,7 8.758,8 39.2,9 43.1,10 1.005,11 1.116,12 0.72,13 0.663,14 7.8,15 17,16 51,18 19,19 32,21 54,22 20,24 14,25 6,26 2,28 22,29 9,30 3,31 5.357}
{0 CHEMBL431691,1 56,2 0.192,3 41,4 582.64,7 7.666,8 39.5,9 46.1,10 1.011,11 1.124,12 0.661,13 0.627,14 2.6,15 18,16 76,18 22,19 43,21 78,22 30,24 21,25 9,26 4,28 35,29 11,30 1,31 5.301}
{0 CHEMBL432114,1 64,2 0.148,3 45,4 630.74,7 7.509,8 40.5,9 46.4,10 1.003,11 1.124,12 0.668,13 0.628,14 4.8,15 22,16 84,18 26,19 49,21 88,22 34,24 23,25 11,26 4,28 39,29 11,30 1,31 7.046}
{0 CHEMBL432917,1 27.5,2 0.147,3 20,4 295.35,7 8.95,8 36.4,9 39.4,10 1.034,11 1.131,12 0.675,13 0.659,14 9.1,15 11,16 33,18 12,19 21,21 34,22 12,24 9,25 3,26 1,28 13,29 8,30 1,31 5.585}
{0 CHEMBL43370,1 65,2 0.186,3 48,4 703.88,7 7.488,8 35.1,9 48.9,10 1.008,11 1.133,12 0.649,13 0.606,14 5.3,15 16,16 94,18 22,19 51,21 97,22 33,24 17,25 16,26 6,28 46,29 15,30 2,31 7.126}
{0 CHEMBL434189,1 50,2 0.108,3 34,4 457.59,7 7.38,8 45.2,9 45.2,10 0.999,11 1.123,12 0.674,13 0.641,14 4.8,15 22,16 62,18 24,19 37,21 65,22 28,24 22,25 6,26 2,27 1,28 28,29 6,31 5.131}
{0 CHEMBL434208,1 36,2 0.173,3 28,4 414.41,5 2,6 1,7 7.969,8 34.6,9 46.2,10 1.024,11 1.14,12 0.644,13 0.615,14 3.8,15 6,16 52,18 10,19 28,21 52,22 18,24 8,25 8,26 3,27 1,28 24,29 10,30 1,31 6.398}
{0 CHEMBL435561,1 85.5,2 0.193,3 61,4 876.07,7 7.618,8 38.3,9 47,10 1.008,11 1.127,12 0.66,13 0.622,14 4.3,15 27,16 115,18 34,19 65,21 119,22 44,24 28,25 16,26 7,28 54,29 17,30 2,31 6.097}
{0 CHEMBL440921,1 35,2 0.149,3 25,4 379.54,7 8.251,8 39.1,9 45.7,10 1.009,11 1.116,12 0.69,13 0.642,14 2.2,15 12,16 46,18 15,19 26,21 47,22 18,24 13,25 5,26 3,28 21,29 7,30 2,31 6}
{0 CHEMBL441817,1 46,2 0.143,3 35,4 499.69,7 7.348,8 38.2,9 48.5,10 1.004,11 1.128,12 0.652,13 0.614,14 4.4,15 12,16 68,18 15,19 37,21 70,22 26,24 14,25 12,26 3,28 33,29 9,30 1,31 6.155}
{0 CHEMBL446393,1 51,2 0.127,3 37,4 535.48,5 2,6 1,7 8.778,8 39.3,9 39.3,10 1.036,11 1.137,12 0.67,13 0.657,14 4.9,15 12,16 61,18 17,19 39,21 63,22 24,24 15,25 7,26 4,27 2,28 24,29 13,30 1,31 7.086}
{0 CHEMBL448098,1 27,2 0.152,3 20,4 301.23,5 2,6 1,7 9.128,8 36.4,9 39.4,10 1.043,11 1.137,12 0.674,13 0.654,14 3,15 6,16 33,18 9,19 20,21 33,22 12,24 7,25 3,26 2,27 1,28 13,29 8,30 1,31 6.62}
{0 CHEMBL47934,1 53,2 0.106,3 35,4 522.77,7 8.57,8 42.6,9 42.6,10 1,11 1.11,12 0.725,13 0.67,14 6.6,15 22,16 61,18 24,19 40,21 66,22 26,24 18,25 8,26 2,28 26,29 9,30 3,31 6.155}
{0 CHEMBL479579,1 47,2 0.151,3 37,4 543.57,7 7.656,8 32.4,9 47.9,10 1.024,11 1.14,12 0.626,13 0.6,14 4.2,15 10,16 71,18 13,19 39,21 73,22 23,24 10,25 13,26 3,28 34,29 14,30 1,31 5.699}
{0 CHEMBL47987,1 51,2 0.109,3 34,4 510.76,7 8.513,8 41.7,9 43.3,10 1,11 1.112,12 0.721,13 0.665,14 6.7,15 22,16 60,18 24,19 38,21 64,22 25,24 18,25 7,26 2,28 26,29 9,30 3,31 6.553}
{0 CHEMBL49081,1 53,2 0.086,3 36,4 554.66,7 10.271,8 42.6,9 33.3,10 1.042,11 1.135,12 0.731,13 0.71,14 7.4,15 22,16 54,18 24,19 40,21 58,22 23,24 18,25 5,26 2,27 4,28 18,29 13,30 3,31 6.602}
{0 CHEMBL49451,1 34.5,2 0.135,3 26,4 392.6,7 7.852,8 36,9 48,10 1.001,11 1.128,12 0.677,13 0.623,14 8,15 11,16 50,18 12,19 28,21 52,22 18,24 9,25 9,26 1,28 24,29 8,30 2,31 5.569}
{0 CHEMBL50330,1 32.5,2 0.093,3 23,4 370.57,7 9.038,8 34.1,9 43.9,10 1.012,11 1.124,12 0.712,13 0.653,14 9.8,15 11,16 41,18 13,19 25,21 43,22 14,24 8,25 6,26 2,28 18,29 9,30 3,31 4.81}
{0 CHEMBL50432,1 44.5,2 0.117,3 31,4 474.73,7 8.329,8 38.6,9 45.6,10 1,11 1.118,12 0.706,13 0.647,14 7,15 17,16 57,18 19,19 34,21 60,22 22,24 14,25 8,26 2,28 26,29 9,30 3,31 5.921}
{0 CHEMBL50772,1 45.5,2 0.093,3 32,4 500.64,7 9.816,8 39.2,9 37.3,10 1.035,11 1.136,12 0.716,13 0.686,14 7.8,15 17,16 51,18 19,19 35,21 54,22 20,24 14,25 6,26 2,27 3,28 19,29 12,30 3,31 5.886}
{0 CHEMBL540674,1 27,2 0.167,3 22,4 337.35,7 9.371,8 36.1,9 38.9,10 1.058,11 1.155,12 0.649,13 0.651,14 2.8,15 6,16 36,18 8,19 22,21 36,22 13,24 8,25 5,26 2,27 3,28 14,29 9,30 1,31 5}
{0 CHEMBL551145,1 27,2 0.171,3 22,4 339.34,7 9.695,8 37.1,9 37.1,10 1.065,11 1.164,12 0.653,13 0.66,14 2.9,15 6,16 35,18 8,19 22,21 35,22 13,24 8,25 5,26 2,27 4,28 13,29 9,30 1,31 5}
{0 CHEMBL551622,1 32,2 0.15,3 24,4 360.39,7 9.241,8 38.5,9 38.5,10 1.048,11 1.151,12 0.665,13 0.66,14 5.1,15 10,16 39,18 12,19 25,21 40,22 15,24 10,25 5,26 2,27 3,28 15,29 9,30 1,31 5}
{0 CHEMBL558146,1 29,2 0.184,3 24,4 371.36,7 9.773,8 36.8,9 36.8,10 1.07,11 1.171,12 0.646,13 0.658,14 2.6,15 6,16 38,18 8,19 24,21 38,22 14,24 8,25 6,26 2,27 5,28 14,29 10,30 1,31 5.616}
{0 CHEMBL560409,1 43,2 0.175,3 33,4 484.54,7 8.652,8 39.3,9 41.1,10 1.037,11 1.142,12 0.659,13 0.648,14 3.6,15 12,16 56,18 15,19 34,21 57,22 22,24 15,25 7,26 3,27 3,28 23,29 11,30 1,31 5}
{0 CHEMBL560685,1 26,2 0.171,3 21,4 321.35,7 9.181,8 37.1,9 40,10 1.05,11 1.154,12 0.655,13 0.649,14 2.9,15 6,16 35,18 8,19 21,21 35,22 13,24 8,25 5,26 2,27 3,28 14,29 8,30 1,31 5}
{0 CHEMBL567628,1 72.5,2 0.185,3 50,4 695.76,7 7.906,8 43.2,9 43.2,10 1.009,11 1.118,12 0.682,13 0.65,14 3.4,15 29,16 88,18 33,19 54,21 92,22 38,24 30,25 8,26 4,28 38,29 12,30 1,31 8.114}
{0 CHEMBL570704,1 81,2 0.167,3 57,4 804.82,7 8.297,8 42.3,9 41.2,10 1.023,11 1.131,12 0.674,13 0.654,14 4.1,15 28,16 97,18 33,19 62,21 102,22 41,24 30,25 11,26 5,27 3,28 40,29 16,30 1,31 5.301}
{0 CHEMBL570718,1 72.5,2 0.185,3 50,4 695.76,7 7.906,8 43.2,9 43.2,10 1.009,11 1.118,12 0.682,13 0.65,14 3.4,15 29,16 88,18 33,19 54,21 92,22 38,24 30,25 8,26 4,28 38,29 12,30 1,31 6.62}
{0 CHEMBL570722,1 87,2 0.164,3 59,4 812.92,7 7.817,8 44.2,9 43.3,10 1.005,11 1.116,12 0.686,13 0.652,14 3.8,15 34,16 104,18 39,19 65,21 110,22 46,24 36,25 10,26 5,28 45,29 13,30 1,31 5}
{0 CHEMBL570732,1 73.5,2 0.183,3 51,4 711.76,7 7.997,8 42.7,9 42.7,10 1.013,11 1.119,12 0.68,13 0.651,14 3.4,15 29,16 89,18 33,19 55,21 93,22 38,24 30,25 8,26 4,28 38,29 13,30 1,31 6.561}
{0 CHEMBL570740,1 80,2 0.168,3 54,4 743.85,7 7.748,8 44.8,9 43.8,10 1.003,11 1.114,12 0.689,13 0.651,14 3.1,15 34,16 96,18 38,19 59,21 101,22 43,24 35,25 8,26 4,28 42,29 11,30 1,31 5}
{0 CHEMBL570811,1 61,2 0.181,3 44,4 621.68,7 7.771,8 40,9 45,10 1.011,11 1.124,12 0.666,13 0.633,14 3.8,15 18,16 80,18 23,19 47,21 83,22 32,24 22,25 10,26 5,28 36,29 12,30 1,31 5.678}
{0 CHEMBL570842,1 77,2 0.172,3 53,4 736.82,7 7.839,8 42.6,9 43.6,10 1.008,11 1.12,12 0.679,13 0.646,14 4.3,15 28,16 94,18 33,19 58,21 99,22 40,24 30,25 10,26 5,28 41,29 13,30 1,31 6.041}
{0 CHEMBL570843,1 78.5,2 0.175,3 53,4 734.8,7 7.987,8 43.5,9 42.4,10 1.01,11 1.118,12 0.685,13 0.654,14 4.3,15 33,16 92,18 37,19 58,21 97,22 40,24 32,25 8,26 4,28 39,29 13,30 1,31 7.854}
{0 CHEMBL570953,1 73.5,2 0.183,3 51,4 711.76,7 7.997,8 42.7,9 42.7,10 1.013,11 1.119,12 0.68,13 0.651,14 3.4,15 29,16 89,18 33,19 55,21 93,22 38,24 30,25 8,26 4,28 38,29 13,30 1,31 7.854}
{0 CHEMBL571153,1 70,2 0.178,3 48,4 667.75,7 7.765,8 43,9 44.2,10 1.006,11 1.118,12 0.681,13 0.645,14 3.5,15 28,16 86,18 32,19 52,21 90,22 37,24 29,25 8,26 4,28 38,29 11,30 1,31 8.921}
{0 CHEMBL571716,1 63,2 0.155,3 44,4 617.69,7 7.721,8 41.3,9 45,10 1.007,11 1.122,12 0.673,13 0.637,14 3.8,15 22,16 80,18 26,19 48,21 84,22 33,24 23,25 10,26 4,28 36,29 11,30 1,31 4.301}
{0 CHEMBL577753,1 78.5,2 0.175,3 53,4 734.8,7 7.987,8 43.5,9 42.4,10 1.01,11 1.118,12 0.685,13 0.654,14 4.3,15 33,16 92,18 37,19 58,21 97,22 40,24 32,25 8,26 4,28 39,29 13,30 1,31 7.585}
{0 CHEMBL577754,1 78.5,2 0.175,3 53,4 734.8,7 7.987,8 43.5,9 42.4,10 1.01,11 1.118,12 0.685,13 0.654,14 4.3,15 33,16 92,18 37,19 58,21 97,22 40,24 32,25 8,26 4,28 39,29 13,30 1,31 8.097}
{0 CHEMBL58117,1 45,2 0.186,3 32,4 455.58,7 7.993,8 40.4,9 43.9,10 1.013,11 1.123,12 0.672,13 0.642,14 5.3,15 16,16 57,18 19,19 34,21 59,22 23,24 17,25 6,26 3,28 25,29 9,30 1,31 4.328}
{0 CHEMBL58315,1 35,2 0.16,3 26,4 361.44,7 7.376,8 36.7,9 46.9,10 1.016,11 1.137,12 0.631,13 0.61,14 6.1,15 10,16 49,18 13,19 27,21 50,22 18,24 11,25 7,26 3,28 23,29 8,31 4.62}
{0 CHEMBL58356,1 32,2 0.163,3 24,4 348.51,7 7.261,8 37.5,9 50,10 1,11 1.127,12 0.654,13 0.608,14 4.2,15 10,16 48,18 12,19 25,21 49,22 18,24 10,25 8,26 2,28 24,29 6,30 1,31 4.921}
{0 CHEMBL58516,1 31,2 0.152,3 23,4 334.48,7 7.433,8 37.8,9 48.9,10 1.002,11 1.127,12 0.659,13 0.614,14 4.4,15 10,16 45,18 12,19 24,21 46,22 17,24 10,25 7,26 2,28 22,29 6,30 1,31 4}
{0 CHEMBL58677,1 44,2 0.179,3 31,4 441.55,7 8.177,8 40.7,9 42.6,10 1.016,11 1.122,12 0.677,13 0.65,14 5.6,15 16,16 54,18 19,19 33,21 56,22 22,24 17,25 5,26 3,28 23,29 9,30 1,31 4.523}
{0 CHEMBL58812,1 31,2 0.152,3 23,4 334.48,7 7.433,8 37.8,9 48.9,10 1.002,11 1.127,12 0.659,13 0.614,14 4.4,15 10,16 45,18 12,19 24,21 46,22 17,24 10,25 7,26 2,28 22,29 6,30 1,31 4}
{0 CHEMBL59179,1 54,2 0.192,3 40,4 568.76,7 7.484,8 38.2,9 47.4,10 1.008,11 1.129,12 0.652,13 0.618,14 5.3,15 16,16 76,18 20,19 42,21 78,22 29,24 18,25 11,26 4,28 36,29 11,30 1,31 4.509}
{0 CHEMBL59674,1 46,2 0.123,3 31,4 433.57,5 1,6 1,7 8.029,8 44.4,9 42.6,10 1.004,11 1.115,12 0.697,13 0.66,14 5.6,15 16,16 54,18 19,19 34,21 57,22 24,24 16,25 7,26 2,28 23,29 7,30 1,31 6.678}
{0 CHEMBL59762,1 44,2 0.133,3 31,4 438.59,7 7.695,8 42.1,9 45.6,10 1.003,11 1.118,12 0.677,13 0.639,14 3.5,15 16,16 57,18 18,19 34,21 60,22 24,24 16,25 8,26 2,28 26,29 7,30 1,31 5.836}
{0 CHEMBL59775,1 52,2 0.139,3 37,4 516.71,7 7.489,8 43.5,9 46.4,10 0.998,11 1.116,12 0.68,13 0.638,14 2.9,15 18,16 69,18 21,19 40,21 72,22 30,24 21,25 9,26 3,28 32,29 7,30 1,31 6.553}
{0 CHEMBL59856,1 44,2 0.133,3 31,4 438.59,7 7.695,8 42.1,9 45.6,10 1.003,11 1.118,12 0.677,13 0.639,14 3.5,15 16,16 57,18 18,19 34,21 60,22 24,24 16,25 8,26 2,28 26,29 7,30 1,31 6.119}
{0 CHEMBL60363,1 45,2 0.125,3 32,4 451.64,7 7.404,8 41,9 47.5,10 0.998,11 1.122,12 0.671,13 0.627,14 4.9,15 16,16 61,18 18,19 35,21 64,22 25,24 16,25 9,26 2,28 29,29 7,30 1,31 6.432}
{0 CHEMBL60439,1 44,2 0.133,3 31,4 438.59,7 7.695,8 42.1,9 45.6,10 1.003,11 1.118,12 0.677,13 0.639,14 3.5,15 16,16 57,18 18,19 34,21 60,22 24,24 16,25 8,26 2,28 26,29 7,30 1,31 8}
{0 CHEMBL60679,1 43,2 0.125,3 32,4 454.64,7 7.333,8 40.3,9 48.4,10 0.999,11 1.122,12 0.663,13 0.62,14 3.2,15 12,16 62,18 15,19 34,21 64,22 25,24 15,25 10,26 3,28 30,29 7,30 1,31 6.292}
{0 CHEMBL61016,1 44,2 0.133,3 31,4 454.66,7 7.976,8 42.1,9 45.6,10 0.999,11 1.113,12 0.698,13 0.647,14 3.5,15 16,16 57,18 18,19 34,21 60,22 24,24 16,25 8,26 2,28 26,29 7,30 2,31 7.456}
{0 CHEMBL61269,1 45,2 0.143,3 34,4 482.7,7 7.099,8 39.7,9 50,10 0.996,11 1.123,12 0.657,13 0.611,14 2.9,15 12,16 68,18 15,19 36,21 70,22 27,24 15,25 12,26 3,28 34,29 7,30 1,31 7.721}
{0 CHEMBL61410,1 45,2 0.162,3 34,4 500.74,7 7.587,8 39.4,9 48.5,10 0.999,11 1.12,12 0.675,13 0.624,14 3,15 12,16 66,18 15,19 36,21 68,22 26,24 15,25 11,26 3,28 32,29 8,30 2,31 7.398}
{0 CHEMBL61640,1 52,2 0.119,3 35,4 484.66,7 7.693,8 46,9 44.4,10 0.996,11 1.11,12 0.697,13 0.654,14 3.2,15 22,16 63,18 24,19 39,21 67,22 29,24 22,25 7,26 2,28 28,29 6,30 1,31 6.854}
{0 CHEMBL61713,1 43,2 0.125,3 30,4 487.45,7 9.197,8 43.4,9 43.4,10 1.004,11 1.112,12 0.712,13 0.664,14 3.8,15 16,16 53,18 18,19 33,20 1,21 56,22 23,24 16,25 7,26 2,28 23,29 7,30 2,31 7.553}
{0 CHEMBL63132,1 45,2 0.147,3 34,4 484.67,7 7.343,8 39.4,9 48.5,10 1.003,11 1.124,12 0.657,13 0.617,14 3,15 12,16 66,18 15,19 36,21 68,22 26,24 15,25 11,26 3,28 32,29 8,30 1,31 6.854}
{0 CHEMBL63317,1 34,2 0.146,3 25,4 346.43,7 7.371,8 36.2,9 46.8,10 1.014,11 1.14,12 0.632,13 0.61,14 8.5,15 10,16 47,18 13,19 26,21 48,22 17,24 11,25 6,26 3,28 22,29 8,31 8.921}
{0 CHEMBL63975,1 26.5,2 0.125,3 19,4 280.33,7 9.043,8 38.7,9 38.7,10 1.032,11 1.124,12 0.687,13 0.668,14 6.5,15 11,16 31,18 12,19 20,21 32,22 12,24 9,25 3,26 1,28 12,29 7,30 1,31 5.854}
{0 CHEMBL64081,1 44,2 0.134,3 33,4 468.67,7 7.21,8 40,9 49.2,10 0.998,11 1.123,12 0.66,13 0.615,14 3.1,15 12,16 65,18 15,19 35,21 67,22 26,24 15,25 11,26 3,28 32,29 7,30 1,31 7.114}
{0 CHEMBL65903,1 32,2 0.167,3 24,4 333.43,7 7.094,8 36.2,9 48.9,10 1.01,11 1.138,12 0.627,13 0.6,14 6.4,15 10,16 47,18 12,19 25,21 48,22 17,24 10,25 7,26 2,28 23,29 7,31 6.301}
{0 CHEMBL66284,1 18,2 0.194,3 16,4 232.27,7 7.258,8 28.1,9 50,10 1.032,11 1.155,12 0.582,13 0.572,14 6.3,16 32,18 3,19 15,21 31,22 9,24 3,25 6,26 3,28 16,29 7,31 11}
{0 CHEMBL66318,1 18,2 0.212,3 16,4 230.3,7 6.774,8 29.4,9 52.9,10 1.017,11 1.152,12 0.586,13 0.562,14 5.9,16 34,18 3,19 15,21 33,22 10,24 3,25 7,26 3,28 18,29 6,31 5.187}
{0 CHEMBL66712,1 15,2 0.227,3 13,4 190.18,7 8.269,8 26.1,9 43.5,10 1.06,11 1.161,12 0.58,13 0.597,14 8.7,16 23,18 3,19 12,21 22,22 6,24 3,25 3,26 3,28 10,29 7,31 5.523}
{0 CHEMBL66882,1 16,2 0.219,3 15,4 218.29,7 6.615,8 27.3,9 54.5,10 1.018,11 1.156,12 0.573,13 0.549,14 6.1,16 33,18 2,19 14,21 32,22 9,24 2,25 7,26 2,28 18,29 6,31 5}
{0 CHEMBL66967,1 34,2 0.149,3 25,4 347.41,7 7.552,8 37,9 45.7,10 1.019,11 1.136,12 0.634,13 0.617,14 6.5,15 10,16 46,18 13,19 26,21 47,22 17,24 11,25 6,26 3,28 21,29 8,31 9.699}
{0 CHEMBL66969,1 24.5,2 0.107,3 17,4 250.3,7 9.27,8 40.7,9 37,10 1.029,11 1.119,12 0.706,13 0.685,14 7.4,15 11,16 27,18 12,19 18,21 28,22 11,24 9,25 2,26 1,28 10,29 6,30 1,31 5.854}
{0 CHEMBL67000,1 17,2 0.179,3 15,4 218.24,7 7.526,8 27.6,9 48.3,10 1.039,11 1.156,12 0.581,13 0.579,14 6.9,16 29,18 3,19 14,21 28,22 8,24 3,25 5,26 3,28 14,29 7,31 8.167}
{0 CHEMBL67104,1 43.5,2 0.106,3 28,4 388.47,7 8.829,8 50,9 36.4,10 1.01,11 1.101,12 0.735,13 0.706,14 4.5,15 23,16 44,18 24,19 31,21 47,22 22,24 21,25 1,26 1,28 16,29 6,30 1,31 5}
{0 CHEMBL67142,1 25.5,2 0.133,3 18,4 265.31,7 9.149,8 41.4,9 37.9,10 1.031,11 1.115,12 0.699,13 0.679,14 3.4,15 11,16 29,18 12,19 19,21 30,22 12,24 10,25 2,26 1,28 11,29 6,30 1,31 4.301}
{0 CHEMBL67348,1 23,2 0.211,3 20,4 289.33,7 7.419,8 28.2,9 48.7,10 1.034,11 1.156,12 0.586,13 0.579,14 7.7,16 39,18 4,19 19,21 38,22 11,24 4,25 7,26 4,28 19,29 9,31 6.824}
{0 CHEMBL67678,1 25.5,2 0.133,3 18,4 249.24,7 8.594,8 41.4,9 37.9,10 1.04,11 1.125,12 0.658,13 0.663,14 3.4,15 11,16 29,18 12,19 19,21 30,22 12,24 10,25 2,26 1,28 11,29 6,31 4.301}
{0 CHEMBL67732,1 23.5,2 0.115,3 16,4 219.22,7 8.769,8 40,9 36,10 1.038,11 1.135,12 0.667,13 0.672,14 12,15 11,16 25,18 12,19 17,21 26,22 10,24 9,25 1,26 1,28 9,29 6,31 5.62}
{0 CHEMBL67834,1 32.5,2 0.2,3 25,4 364.51,7 7.439,8 36.7,9 49,10 1.006,11 1.129,12 0.65,13 0.61,14 4.1,15 11,16 49,18 12,19 26,21 50,22 18,24 9,25 9,26 1,28 24,29 7,30 1,31 5.886}
{0 CHEMBL67845,1 33.5,2 0.196,3 26,4 380.51,7 7.61,8 36,9 48,10 1.013,11 1.131,12 0.646,13 0.612,14 4,15 11,16 50,18 12,19 27,21 51,22 18,24 9,25 9,26 1,28 24,29 8,30 1,31 5.886}
{0 CHEMBL67884,1 23.5,2 0.12,3 16,4 236.27,7 9.845,8 41.7,9 33.3,10 1.038,11 1.116,12 0.721,13 0.706,14 8.3,15 11,16 24,18 12,19 17,21 25,22 10,24 9,25 1,26 1,28 8,29 6,30 1,31 4.62}
{0 CHEMBL68017,1 46,2 0.169,3 33,4 450.59,7 7.152,8 39.7,9 47.6,10 1.003,11 1.131,12 0.647,13 0.616,14 6.3,15 16,16 63,18 19,19 35,21 65,22 25,24 17,25 8,26 3,28 30,29 8,31 5}
{0 CHEMBL68128,1 35,2 0.16,3 26,4 361.44,7 7.376,8 36.7,9 46.9,10 1.016,11 1.137,12 0.631,13 0.61,14 6.1,15 10,16 49,18 13,19 27,21 50,22 18,24 11,25 7,26 3,28 23,29 8,31 7.584}
{0 CHEMBL68227,1 22.5,2 0.083,3 15,4 220.27,7 9.577,8 43.5,9 34.8,10 1.025,11 1.112,12 0.733,13 0.706,14 8.7,15 11,16 23,18 12,19 16,21 24,22 10,24 9,25 1,26 1,28 8,29 5,30 1,31 5}
{0 CHEMBL68402,1 41,2 0.093,3 26,4 362.43,7 9.061,8 50,9 35,10 1.014,11 1.101,12 0.74,13 0.713,14 5,15 22,16 40,18 23,19 29,21 43,22 20,24 19,25 1,26 1,28 14,29 6,30 1,31 5.824}
{0 CHEMBL69745,1 23,2 0.205,3 20,4 288.35,7 7.209,8 27.5,9 50,10 1.028,11 1.159,12 0.585,13 0.572,14 10,16 40,18 4,19 19,21 39,22 11,24 4,25 7,26 4,28 20,29 9,31 5.523}
{0 CHEMBL69793,1 19,2 0.206,3 17,4 246.3,7 7.037,8 28.6,9 51.4,10 1.026,11 1.153,12 0.582,13 0.567,14 5.7,16 35,18 3,19 16,21 34,22 10,24 3,25 7,26 3,28 18,29 7,31 6.721}
{0 CHEMBL69984,1 35.5,2 0.143,3 24,4 340.43,7 8.511,8 45,9 40,10 1.011,11 1.111,12 0.709,13 0.677,14 5,15 17,16 40,18 18,19 26,21 42,22 18,24 15,25 3,26 1,28 16,29 6,30 1,31 6.009}
{0 CHEMBL70080,1 34.5,2 0.128,3 23,4 326.4,7 8.822,8 45.9,9 37.8,10 1.015,11 1.109,12 0.719,13 0.69,14 5.4,15 17,16 37,18 18,19 25,21 39,22 17,24 15,25 2,26 1,28 14,29 6,30 1,31 6.066}
{0 CHEMBL75433,1 23,2 0.189,3 18,4 269.4,7 7.281,8 35.1,9 51.4,10 1.003,11 1.129,12 0.645,13 0.597,14 2.7,15 6,16 37,18 8,19 18,21 37,22 13,24 7,25 6,26 2,28 19,29 5,30 1,31 4}
{0 CHEMBL77258,1 22,2 0.159,3 19,4 291.46,7 6.624,8 29.5,9 56.8,10 1.002,11 1.142,12 0.605,13 0.554,14 2.3,16 44,18 3,19 19,21 44,22 13,24 1,25 12,26 3,28 25,29 6,30 1,31 4.108}
{0 CHEMBL81732,1 44,2 0.132,3 34,4 497.54,7 7.538,8 33.3,9 48.5,10 1.017,11 1.138,12 0.633,13 0.6,14 4.5,15 10,16 66,18 13,19 36,21 68,22 22,24 10,25 12,26 3,28 32,29 12,30 1,31 5.297}
{0 CHEMBL85320,1 27,2 0.179,3 21,4 294.34,7 7.547,8 35.9,9 46.2,10 1.023,11 1.138,12 0.625,13 0.611,14 5.1,15 6,16 39,18 9,19 21,21 39,22 14,24 9,25 5,26 3,28 18,29 7,31 8.097}
{0 CHEMBL9963,1 55,2 0.136,3 36,4 499.55,7 8.057,8 43.5,9 41.9,10 1.003,11 1.12,12 0.701,13 0.661,14 8.1,15 28,16 62,18 29,19 40,21 66,22 27,24 23,25 4,26 1,28 26,29 9,30 1,31 6.796}
