{
  "data_set_description": {
    "collection_date": "November 2013",
    "creator": "Dr Jeremy Besnard, Dr Ivan Olier, Dr Noureddin Sadawi, Dr Larisa Soldatova, Dr Crina Grosan, Prof Ross King, Dr Richard Bickerton, Prof Andrew Hopkins and Dr Willem van Hoorn",
    "default_target_attribute": "pXC50",
    "description": "This dataset contains QSAR data (from ChEMBL version 17) showing activity values (unit is pseudo-pCI50) of several compounds on drug target ChEMBL_ID: CHEMBL6165 (TID: 101463), and it has 61 rows and 43 features (not including molecule IDs and class feature: molecule_id and pXC50). The features represent Basic Molecular Descriptors which were generated from SMILES strings.  Missing value imputation was applied to this dataset (By choosing the Median).",
    "description_version": "1",
    "file_id": "3421197",
    "format": "ARFF",
    "id": "30491",
    "licence": "Public",
    "md5_checksum": "3506e3ba3e1e2f080c472029f1a849c9",
    "minio_url": "https://data.openml.org/datasets/0003/30491/dataset_30491.pq",
    "name": "QSAR-DATASET-FOR-DRUG-TARGET-CHEMBL6165",
    "original_data_url": "https://www.ebi.ac.uk/chembl/target/inspect/CHEMBL6165",
    "parquet_url": "https://data.openml.org/datasets/0003/30491/dataset_30491.pq",
    "processing_date": "2018-10-04 01:50:54",
    "row_id_attribute": "molecule_id",
    "status": "deactivated",
    "tag": [
      "MetaQSAR",
      "study_13"
    ],
    "upload_date": "2016-07-15T05:08:28",
    "url": "https://api.openml.org/data/v1/download/3421197/QSAR-DATASET-FOR-DRUG-TARGET-CHEMBL6165.arff",
    "version": "7",
    "visibility": "public"
  }
}