{
  "data_set_description": {
    "collection_date": "November 2013",
    "creator": "Dr Jeremy Besnard, Dr Ivan Olier, Dr Noureddin Sadawi, Dr Larisa Soldatova, Dr Crina Grosan, Prof Ross King, Dr Richard Bickerton, Prof Andrew Hopkins and Dr Willem van Hoorn",
    "default_target_attribute": "pXC50",
    "description": "This dataset contains QSAR data (from ChEMBL version 17) showing activity values (unit is pseudo-pCI50) of several compounds on drug target ChEMBL_ID: CHEMBL5440 (TID: 101196), and it has 58 rows and 43 features (not including molecule IDs and class feature: molecule_id and pXC50). The features represent Basic Molecular Descriptors which were generated from SMILES strings.  Missing value imputation was applied to this dataset (By choosing the Median).",
    "description_version": "1",
    "file_id": "3420697",
    "format": "ARFF",
    "id": "30475",
    "licence": "Public",
    "md5_checksum": "959257031efa4ef98138ec00a2efee6e",
    "minio_url": "https://data.openml.org/datasets/0003/30475/dataset_30475.pq",
    "name": "QSAR-DATASET-FOR-DRUG-TARGET-CHEMBL5440",
    "original_data_url": "https://www.ebi.ac.uk/chembl/target/inspect/CHEMBL5440",
    "parquet_url": "https://data.openml.org/datasets/0003/30475/dataset_30475.pq",
    "processing_date": "2018-10-04 01:53:08",
    "row_id_attribute": "molecule_id",
    "status": "deactivated",
    "tag": [
      "MetaQSAR",
      "study_13"
    ],
    "upload_date": "2016-07-15T05:06:08",
    "url": "https://api.openml.org/data/v1/download/3420697/QSAR-DATASET-FOR-DRUG-TARGET-CHEMBL5440.arff",
    "version": "8",
    "visibility": "public"
  }
}