"molecule_id","FCFP4_1024b314","FCFP4_1024b898","FCFP4_1024b165","FCFP4_1024b923","FCFP4_1024b957","FCFP4_1024b37","FCFP4_1024b630","FCFP4_1024b644","FCFP4_1024b1","FCFP4_1024b10","FCFP4_1024b100","FCFP4_1024b1000","FCFP4_1024b1001","FCFP4_1024b1002","FCFP4_1024b1003","FCFP4_1024b1004","FCFP4_1024b1005","FCFP4_1024b1006","FCFP4_1024b1007","FCFP4_1024b1008","FCFP4_1024b1009","FCFP4_1024b101","FCFP4_1024b1010","FCFP4_1024b1011","FCFP4_1024b1012","FCFP4_1024b1013","FCFP4_1024b1014","FCFP4_1024b1015","FCFP4_1024b1016","FCFP4_1024b1017","FCFP4_1024b1018","FCFP4_1024b1019","FCFP4_1024b102","FCFP4_1024b1020","FCFP4_1024b1021","FCFP4_1024b1022","FCFP4_1024b1023","FCFP4_1024b1024","FCFP4_1024b103","FCFP4_1024b104","FCFP4_1024b105","FCFP4_1024b106","FCFP4_1024b107","FCFP4_1024b108","FCFP4_1024b109","FCFP4_1024b11","FCFP4_1024b110","FCFP4_1024b111","FCFP4_1024b112","FCFP4_1024b113","FCFP4_1024b114","pXC50"
{9 1,52 5.113}
{0 CHEMBL1164729,3 1,9 1,10 1,14 1,19 1,52 7.523}
{0 CHEMBL117,9 1,52 6.076}
{0 CHEMBL1276946,9 1,52 4.523}
{0 CHEMBL1277122,9 1,52 4.523}
{0 CHEMBL13486,9 1,27 1,52 4.775}
{0 CHEMBL1467,12 1,39 1,52 5.378}
{0 CHEMBL150,9 1,37 1,52 5.975}
{0 CHEMBL151,9 1,52 4.938}
{0 CHEMBL161957,9 1,52 4.438}
{0 CHEMBL164,9 1,37 1,52 5.623}
{0 CHEMBL164921,39 1,52 4.061}
{0 CHEMBL17291,9 1,44 1,52 4.502}
{0 CHEMBL1761208,1 1,2 1,3 1,4 1,5 1,6 1,7 1,8 1,9 1,10 1,52 4.423}
{0 CHEMBL1761209,1 1,2 1,3 1,4 1,5 1,6 1,7 1,8 1,9 1,10 1,52 4.184}
{0 CHEMBL1761210,1 1,2 1,3 1,4 1,5 1,6 1,7 1,8 1,9 1,10 1,52 4.325}
{0 CHEMBL1761212,1 1,2 1,3 1,4 1,5 1,6 1,7 1,8 1,9 1,10 1,52 4.248}
{0 CHEMBL1761213,1 1,2 1,3 1,4 1,5 1,6 1,7 1,8 1,9 1,10 1,52 4.085}
{0 CHEMBL1761214,1 1,2 1,3 1,4 1,5 1,6 1,7 1,8 1,9 1,10 1,52 4.162}
{0 CHEMBL1761215,1 1,2 1,3 1,4 1,5 1,9 1,52 4.201}
{0 CHEMBL1761216,1 1,2 1,3 1,4 1,5 1,9 1,52 4.137}
{0 CHEMBL1761217,1 1,2 1,3 1,4 1,5 1,6 1,7 1,8 1,9 1,10 1,52 4.272}
{0 CHEMBL1761218,1 1,2 1,3 1,4 1,5 1,6 1,7 1,8 1,9 1,10 1,52 4.037}
{0 CHEMBL1761219,1 1,2 1,3 1,4 1,5 1,6 1,7 1,8 1,9 1,10 1,52 4.354}
{0 CHEMBL1927147,4 1,6 1,7 1,8 1,9 1,10 1,52 4.523}
{0 CHEMBL2205493,34 1,52 4.523}
{0 CHEMBL2205494,9 1,34 1,52 5.305}
{0 CHEMBL2205495,9 1,34 1,52 5.788}
{0 CHEMBL2205496,9 1,34 1,52 5.613}
{0 CHEMBL2205497,9 1,34 1,52 5.678}
{0 CHEMBL2205498,9 1,34 1,52 6.222}
{0 CHEMBL2205499,9 1,34 1,52 5.034}
{0 CHEMBL2205500,9 1,34 1,52 4.782}
{0 CHEMBL2205501,34 1,52 6.509}
{0 CHEMBL2205502,9 1,34 1,52 5.438}
{0 CHEMBL2205503,5 1,34 1,52 5.607}
{0 CHEMBL2205504,9 1,34 1,52 4.699}
{0 CHEMBL2205505,9 1,34 1,52 5.173}
{0 CHEMBL2205506,9 1,14 1,34 1,52 5.717}
{0 CHEMBL2205507,9 1,34 1,52 6.022}
{0 CHEMBL2205508,9 1,34 1,52 6.854}
{0 CHEMBL2205509,9 1,10 1,14 1,34 1,52 7.699}
{0 CHEMBL226335,9 1,27 1,52 4.282}
{0 CHEMBL226345,34 1,52 4.963}
{0 CHEMBL232615,9 1,44 1,52 4.678}
{0 CHEMBL242529,9 1,44 1,52 4.027}
{0 CHEMBL242739,9 1,27 1,52 5.18}
{0 CHEMBL244743,9 1,44 1,52 5.086}
{0 CHEMBL250450,9 1,52 4.441}
{0 CHEMBL266564,9 1,44 1,52 4}
{0 CHEMBL275563,9 1,32 1,52 4.301}
{0 CHEMBL276915,9 1,52 4.42}
{0 CHEMBL28,9 1,52 6.155}
{0 CHEMBL28626,9 1,37 1,52 4.996}
{0 CHEMBL294009,9 1,37 1,52 4}
{0 CHEMBL305113,9 1,43 1,52 4.673}
{0 CHEMBL309490,9 1,37 1,52 5.745}
{0 CHEMBL311498,9 1,52 4}
{0 CHEMBL311805,9 1,39 1,52 5.9}
{0 CHEMBL312213,9 1,52 5.348}
{0 CHEMBL314120,9 1,34 1,43 1,52 4}
{0 CHEMBL314168,9 1,52 4.109}
{0 CHEMBL314647,9 1,39 1,52 4.395}
{0 CHEMBL315417,9 1,52 4}
{0 CHEMBL315561,9 1,43 1,52 5.684}
{0 CHEMBL315625,9 1,15 1,52 6.051}
{0 CHEMBL315735,9 1,46 1,52 4.437}
{0 CHEMBL31574,9 1,37 1,52 5.364}
{0 CHEMBL315969,9 1,52 4}
{0 CHEMBL316254,9 1,12 1,48 1,52 4}
{0 CHEMBL325372,9 1,52 4.301}
{0 CHEMBL337309,9 1,52 4}
{0 CHEMBL379064,9 1,37 1,52 5.6}
{0 CHEMBL388593,12 1,34 1,39 1,52 4.519}
{0 CHEMBL443354,9 1,10 1,34 1,52 4}
{0 CHEMBL446449,9 1,43 1,44 1,52 4.992}
{0 CHEMBL447311,9 1,44 1,52 4.732}
{0 CHEMBL447820,9 1,27 1,52 4}
{0 CHEMBL448272,9 1,10 1,34 1,52 4}
{0 CHEMBL451090,9 1,27 1,37 1,52 5.213}
{0 CHEMBL451678,9 1,17 1,52 4.71}
{0 CHEMBL452145,9 1,10 1,34 1,52 4}
{0 CHEMBL452979,9 1,27 1,52 4.924}
{0 CHEMBL454228,9 1,44 1,52 4}
{0 CHEMBL455678,9 1,37 1,52 4}
{0 CHEMBL459842,9 1,34 1,50 1,52 6.745}
{0 CHEMBL459843,9 1,34 1,50 1,52 5.178}
{0 CHEMBL460379,9 1,10 1,34 1,52 4}
{0 CHEMBL460460,9 1,10 1,34 1,52 4}
{0 CHEMBL460873,9 1,34 1,50 1,52 4.708}
{0 CHEMBL467247,9 1,28 1,52 4.015}
{0 CHEMBL468318,9 1,52 4.796}
{0 CHEMBL469613,9 1,17 1,52 4.775}
{0 CHEMBL470950,9 1,52 4.376}
{0 CHEMBL47386,9 1,52 4}
{0 CHEMBL478458,9 1,35 1,52 4.672}
{0 CHEMBL486027,9 1,52 4.528}
{0 CHEMBL487810,9 1,52 4.444}
{0 CHEMBL50,9 1,37 1,52 5.553}
{0 CHEMBL500751,9 1,23 1,34 1,50 1,52 4.092}
{0 CHEMBL501550,9 1,27 1,52 4.83}
{0 CHEMBL501787,9 1,10 1,34 1,52 4}
{0 CHEMBL503182,9 1,37 1,52 5.186}
{0 CHEMBL503232,9 1,44 1,52 4}
{0 CHEMBL503708,9 1,10 1,34 1,50 1,52 6.398}
{0 CHEMBL504233,9 1,37 1,52 4}
{0 CHEMBL504279,9 1,37 1,52 4}
{0 CHEMBL505322,9 1,34 1,50 1,52 4.761}
{0 CHEMBL508463,9 1,10 1,23 1,34 1,52 5.127}
{0 CHEMBL508899,9 1,23 1,43 1,50 1,52 4.734}
{0 CHEMBL511791,9 1,52 4.376}
{0 CHEMBL512212,34 1,50 1,52 5.658}
{0 CHEMBL513450,9 1,10 1,34 1,52 4.702}
{0 CHEMBL516849,9 1,52 4.098}
{0 CHEMBL517637,9 1,52 4}
{0 CHEMBL518487,9 1,10 1,23 1,43 1,52 4}
{0 CHEMBL538608,9 1,18 1,52 4.783}
{0 CHEMBL583912,9 1,52 4}
{0 CHEMBL64616,9 1,43 1,52 4.505}
{0 CHEMBL65675,9 1,52 4.809}
{0 CHEMBL727,34 1,52 4.034}
{0 CHEMBL73930,9 1,28 1,52 4}
{0 CHEMBL73933,9 1,52 4.523}
{0 CHEMBL75589,9 1,37 1,52 5.114}
{0 CHEMBL76447,9 1,28 1,52 4}
{0 CHEMBL82242,9 1,27 1,52 4.416}
{0 CHEMBL82268,9 1,15 1,39 1,52 4.613}
{0 CHEMBL8260,9 1,52 5.554}
{0 CHEMBL82703,9 1,47 1,52 6.796}
{0 CHEMBL82755,9 1,52 6.31}
{0 CHEMBL82756,9 1,12 1,48 1,52 4}
{0 CHEMBL82848,9 1,46 1,52 4.032}
{0 CHEMBL82957,9 1,52 5.244}
{0 CHEMBL83072,9 1,52 4.175}
{0 CHEMBL83516,9 1,34 1,43 1,52 4}
{0 CHEMBL83530,9 1,43 1,48 1,52 5.85}
{0 CHEMBL84310,9 1,43 1,52 4.569}
{0 CHEMBL84609,9 1,52 5.411}
{0 CHEMBL84620,9 1,12 1,48 1,52 4}
{0 CHEMBL84643,9 1,43 1,48 1,52 5.672}
{0 CHEMBL84772,9 1,12 1,48 1,52 4}
{0 CHEMBL85062,9 1,43 1,52 4}
{0 CHEMBL85314,9 1,15 1,52 4}
{0 CHEMBL85381,9 1,15 1,39 1,52 5.73}
{0 CHEMBL85737,9 1,43 1,48 1,52 5.955}
{0 CHEMBL86021,9 1,52 5.545}
{0 CHEMBL86056,9 1,52 6.939}
{0 CHEMBL86132,9 1,34 1,43 1,52 4}
{0 CHEMBL86311,9 1,43 1,48 1,52 4.9}
{0 CHEMBL87562,9 1,52 6.481}
{0 CHEMBL92193,3 1,9 1,31 1,34 1,52 4.024}
{0 CHEMBL9352,9 1,52 4.301}
