{
  "data_features": {
    "feature": [
      {
        "data_type": "nominal",
        "index": "0",
        "is_ignore": "false",
        "is_row_identifier": "true",
        "is_target": "false",
        "name": "molecule_id",
        "nominal_value": [
          "CHEMBL1048",
          "CHEMBL119214",
          "CHEMBL120200",
          "CHEMBL120779",
          "CHEMBL123623",
          "CHEMBL123958",
          "CHEMBL124095",
          "CHEMBL124259",
          "CHEMBL124741",
          "CHEMBL125135",
          "CHEMBL127162",
          "CHEMBL127579",
          "CHEMBL127665",
          "CHEMBL127816",
          "CHEMBL127842",
          "CHEMBL128068",
          "CHEMBL128151",
          "CHEMBL128164",
          "CHEMBL128317",
          "CHEMBL128364",
          "CHEMBL128477",
          "CHEMBL128483",
          "CHEMBL128531",
          "CHEMBL128548",
          "CHEMBL128583",
          "CHEMBL128641",
          "CHEMBL128676",
          "CHEMBL128697",
          "CHEMBL128771",
          "CHEMBL128794",
          "CHEMBL129079",
          "CHEMBL129142",
          "CHEMBL129570",
          "CHEMBL12985",
          "CHEMBL129866",
          "CHEMBL129893",
          "CHEMBL130140",
          "CHEMBL130384",
          "CHEMBL130428",
          "CHEMBL130442",
          "CHEMBL130463",
          "CHEMBL130495",
          "CHEMBL130846",
          "CHEMBL130872",
          "CHEMBL130873",
          "CHEMBL130948",
          "CHEMBL130985",
          "CHEMBL131008",
          "CHEMBL131025",
          "CHEMBL131148",
          "CHEMBL131166",
          "CHEMBL131173",
          "CHEMBL131247",
          "CHEMBL131266",
          "CHEMBL131287",
          "CHEMBL131304",
          "CHEMBL131345",
          "CHEMBL131502",
          "CHEMBL131507",
          "CHEMBL131514",
          "CHEMBL131582",
          "CHEMBL131611",
          "CHEMBL131934",
          "CHEMBL132162",
          "CHEMBL132167",
          "CHEMBL132341",
          "CHEMBL132449",
          "CHEMBL132582",
          "CHEMBL133398",
          "CHEMBL133462",
          "CHEMBL133788",
          "CHEMBL133790",
          "CHEMBL141233",
          "CHEMBL141665",
          "CHEMBL14180",
          "CHEMBL142395",
          "CHEMBL142627",
          "CHEMBL14268",
          "CHEMBL142803",
          "CHEMBL142805",
          "CHEMBL143639",
          "CHEMBL143788",
          "CHEMBL143874",
          "CHEMBL14408",
          "CHEMBL14450",
          "CHEMBL14451",
          "CHEMBL14569",
          "CHEMBL14819",
          "CHEMBL15035",
          "CHEMBL15120",
          "CHEMBL15132",
          "CHEMBL15161",
          "CHEMBL15177",
          "CHEMBL15232",
          "CHEMBL15292",
          "CHEMBL15306",
          "CHEMBL15344",
          "CHEMBL15367",
          "CHEMBL15370",
          "CHEMBL15405",
          "CHEMBL15419",
          "CHEMBL15481",
          "CHEMBL15485",
          "CHEMBL15489",
          "CHEMBL15491",
          "CHEMBL15500",
          "CHEMBL15513",
          "CHEMBL161041",
          "CHEMBL162358",
          "CHEMBL168854",
          "CHEMBL169639",
          "CHEMBL169743",
          "CHEMBL170226",
          "CHEMBL171666",
          "CHEMBL172457",
          "CHEMBL173289",
          "CHEMBL17344",
          "CHEMBL175119",
          "CHEMBL175401",
          "CHEMBL176286",
          "CHEMBL178221",
          "CHEMBL18081",
          "CHEMBL18085",
          "CHEMBL18132",
          "CHEMBL18177",
          "CHEMBL18204",
          "CHEMBL18265",
          "CHEMBL18273",
          "CHEMBL18281",
          "CHEMBL18309",
          "CHEMBL18339",
          "CHEMBL18381",
          "CHEMBL18396",
          "CHEMBL18405",
          "CHEMBL18413",
          "CHEMBL18450",
          "CHEMBL18459",
          "CHEMBL18471",
          "CHEMBL18490",
          "CHEMBL18518",
          "CHEMBL18558",
          "CHEMBL18564",
          "CHEMBL18589",
          "CHEMBL18597",
          "CHEMBL18600",
          "CHEMBL18671",
          "CHEMBL18699",
          "CHEMBL18703",
          "CHEMBL18748",
          "CHEMBL18775",
          "CHEMBL18816",
          "CHEMBL18827",
          "CHEMBL18833",
          "CHEMBL18864",
          "CHEMBL18866",
          "CHEMBL18918",
          "CHEMBL18919",
          "CHEMBL18956",
          "CHEMBL18979",
          "CHEMBL19072",
          "CHEMBL19085",
          "CHEMBL19091",
          "CHEMBL19102",
          "CHEMBL19106",
          "CHEMBL19136",
          "CHEMBL19154",
          "CHEMBL19158",
          "CHEMBL19258",
          "CHEMBL19281",
          "CHEMBL196220",
          "CHEMBL19862",
          "CHEMBL21247",
          "CHEMBL21286",
          "CHEMBL21333",
          "CHEMBL21595",
          "CHEMBL22016",
          "CHEMBL22033",
          "CHEMBL22776",
          "CHEMBL2364537",
          "CHEMBL24256",
          "CHEMBL24505",
          "CHEMBL24506",
          "CHEMBL24596",
          "CHEMBL24613",
          "CHEMBL24652",
          "CHEMBL24758",
          "CHEMBL25819",
          "CHEMBL25841",
          "CHEMBL25885",
          "CHEMBL26002",
          "CHEMBL26080",
          "CHEMBL262370",
          "CHEMBL262391",
          "CHEMBL26284",
          "CHEMBL26332",
          "CHEMBL26384",
          "CHEMBL26617",
          "CHEMBL267475",
          "CHEMBL267976",
          "CHEMBL273343",
          "CHEMBL274038",
          "CHEMBL274049",
          "CHEMBL274913",
          "CHEMBL275357",
          "CHEMBL275385",
          "CHEMBL275823",
          "CHEMBL275866",
          "CHEMBL276036",
          "CHEMBL276136",
          "CHEMBL276584",
          "CHEMBL277292",
          "CHEMBL277332",
          "CHEMBL277533",
          "CHEMBL277831",
          "CHEMBL278210",
          "CHEMBL278220",
          "CHEMBL278411",
          "CHEMBL278920",
          "CHEMBL279630",
          "CHEMBL279770",
          "CHEMBL279773",
          "CHEMBL279849",
          "CHEMBL280260",
          "CHEMBL280285",
          "CHEMBL280298",
          "CHEMBL280310",
          "CHEMBL280481",
          "CHEMBL281066",
          "CHEMBL282524",
          "CHEMBL283455",
          "CHEMBL28363",
          "CHEMBL283754",
          "CHEMBL283883",
          "CHEMBL283886",
          "CHEMBL284128",
          "CHEMBL284322",
          "CHEMBL284624",
          "CHEMBL284730",
          "CHEMBL285070",
          "CHEMBL285300",
          "CHEMBL28595",
          "CHEMBL285954",
          "CHEMBL285994",
          "CHEMBL286626",
          "CHEMBL286797",
          "CHEMBL286827",
          "CHEMBL286885",
          "CHEMBL287302",
          "CHEMBL287559",
          "CHEMBL287722",
          "CHEMBL28797",
          "CHEMBL288144",
          "CHEMBL288369",
          "CHEMBL288943",
          "CHEMBL28902",
          "CHEMBL289540",
          "CHEMBL289880",
          "CHEMBL29067",
          "CHEMBL291032",
          "CHEMBL29158",
          "CHEMBL295268",
          "CHEMBL295281",
          "CHEMBL295368",
          "CHEMBL295664",
          "CHEMBL296097",
          "CHEMBL297396",
          "CHEMBL298642",
          "CHEMBL298727",
          "CHEMBL298939",
          "CHEMBL29937",
          "CHEMBL300701",
          "CHEMBL300846",
          "CHEMBL300940",
          "CHEMBL301498",
          "CHEMBL301928",
          "CHEMBL310446",
          "CHEMBL310884",
          "CHEMBL311868",
          "CHEMBL31325",
          "CHEMBL313567",
          "CHEMBL314449",
          "CHEMBL315557",
          "CHEMBL316155",
          "CHEMBL316688",
          "CHEMBL31714",
          "CHEMBL319802",
          "CHEMBL32136",
          "CHEMBL32138",
          "CHEMBL32426",
          "CHEMBL32764",
          "CHEMBL327841",
          "CHEMBL327942",
          "CHEMBL328325",
          "CHEMBL328702",
          "CHEMBL32944",
          "CHEMBL330649",
          "CHEMBL331747",
          "CHEMBL331884",
          "CHEMBL33228",
          "CHEMBL332680",
          "CHEMBL33276",
          "CHEMBL33294",
          "CHEMBL33329",
          "CHEMBL33331",
          "CHEMBL334122",
          "CHEMBL335000",
          "CHEMBL335889",
          "CHEMBL33607",
          "CHEMBL336101",
          "CHEMBL336183",
          "CHEMBL336194",
          "CHEMBL336298",
          "CHEMBL336606",
          "CHEMBL336607",
          "CHEMBL337058",
          "CHEMBL337059",
          "CHEMBL337162",
          "CHEMBL337195",
          "CHEMBL33729",
          "CHEMBL337473",
          "CHEMBL338166",
          "CHEMBL338497",
          "CHEMBL33871",
          "CHEMBL338876",
          "CHEMBL339242",
          "CHEMBL339277",
          "CHEMBL339461",
          "CHEMBL339713",
          "CHEMBL339716",
          "CHEMBL339897",
          "CHEMBL339958",
          "CHEMBL341172",
          "CHEMBL34177",
          "CHEMBL344756",
          "CHEMBL34507",
          "CHEMBL34611",
          "CHEMBL34740",
          "CHEMBL34835",
          "CHEMBL352814",
          "CHEMBL35731",
          "CHEMBL36113",
          "CHEMBL36158",
          "CHEMBL36386",
          "CHEMBL36607",
          "CHEMBL36652",
          "CHEMBL367424",
          "CHEMBL37188",
          "CHEMBL37255",
          "CHEMBL37354",
          "CHEMBL38052",
          "CHEMBL39077",
          "CHEMBL39250",
          "CHEMBL39586",
          "CHEMBL39794",
          "CHEMBL39876",
          "CHEMBL40009",
          "CHEMBL40010",
          "CHEMBL40069",
          "CHEMBL40117",
          "CHEMBL40153",
          "CHEMBL40213",
          "CHEMBL406006",
          "CHEMBL40686",
          "CHEMBL40836",
          "CHEMBL408753",
          "CHEMBL40992",
          "CHEMBL41230",
          "CHEMBL41301",
          "CHEMBL413742",
          "CHEMBL41395",
          "CHEMBL414462",
          "CHEMBL415903",
          "CHEMBL415981",
          "CHEMBL416161",
          "CHEMBL41620",
          "CHEMBL416249",
          "CHEMBL416251",
          "CHEMBL416344",
          "CHEMBL416769",
          "CHEMBL416973",
          "CHEMBL417135",
          "CHEMBL417271",
          "CHEMBL418002",
          "CHEMBL418551",
          "CHEMBL418947",
          "CHEMBL419796",
          "CHEMBL420055",
          "CHEMBL42051",
          "CHEMBL422404",
          "CHEMBL422609",
          "CHEMBL422616",
          "CHEMBL423134",
          "CHEMBL423333",
          "CHEMBL42410",
          "CHEMBL424257",
          "CHEMBL42520",
          "CHEMBL428868",
          "CHEMBL429975",
          "CHEMBL430147",
          "CHEMBL431348",
          "CHEMBL434013",
          "CHEMBL434053",
          "CHEMBL434992",
          "CHEMBL43509",
          "CHEMBL43602",
          "CHEMBL43821",
          "CHEMBL43874",
          "CHEMBL442150",
          "CHEMBL442263",
          "CHEMBL444331",
          "CHEMBL44734",
          "CHEMBL45850",
          "CHEMBL45965",
          "CHEMBL46343",
          "CHEMBL46362",
          "CHEMBL46663",
          "CHEMBL47376",
          "CHEMBL47430",
          "CHEMBL47662",
          "CHEMBL48483",
          "CHEMBL48829",
          "CHEMBL49221",
          "CHEMBL49298",
          "CHEMBL49449",
          "CHEMBL49519",
          "CHEMBL49696",
          "CHEMBL50370",
          "CHEMBL50422",
          "CHEMBL50733",
          "CHEMBL51241",
          "CHEMBL51544",
          "CHEMBL51585",
          "CHEMBL516",
          "CHEMBL51739",
          "CHEMBL51891",
          "CHEMBL52492",
          "CHEMBL52744",
          "CHEMBL52896",
          "CHEMBL52906",
          "CHEMBL53252",
          "CHEMBL53347",
          "CHEMBL541010",
          "CHEMBL54453",
          "CHEMBL54744",
          "CHEMBL549431",
          "CHEMBL54955",
          "CHEMBL549700",
          "CHEMBL550456",
          "CHEMBL550458",
          "CHEMBL550654",
          "CHEMBL550859",
          "CHEMBL551520",
          "CHEMBL551923",
          "CHEMBL554154",
          "CHEMBL554691",
          "CHEMBL555048",
          "CHEMBL555910",
          "CHEMBL556420",
          "CHEMBL557105",
          "CHEMBL55750",
          "CHEMBL557850",
          "CHEMBL557924",
          "CHEMBL558443",
          "CHEMBL558638",
          "CHEMBL559928",
          "CHEMBL560385",
          "CHEMBL560522",
          "CHEMBL561321",
          "CHEMBL561381",
          "CHEMBL561524",
          "CHEMBL562324",
          "CHEMBL562383",
          "CHEMBL562524",
          "CHEMBL562575",
          "CHEMBL562906",
          "CHEMBL562930",
          "CHEMBL563165",
          "CHEMBL564275",
          "CHEMBL564798",
          "CHEMBL564954",
          "CHEMBL565228",
          "CHEMBL603",
          "CHEMBL78140",
          "CHEMBL78141",
          "CHEMBL787",
          "CHEMBL79124",
          "CHEMBL79366",
          "CHEMBL79479",
          "CHEMBL79732",
          "CHEMBL79741",
          "CHEMBL79952",
          "CHEMBL81642",
          "CHEMBL81711",
          "CHEMBL82190",
          "CHEMBL82758",
          "CHEMBL83166",
          "CHEMBL83267",
          "CHEMBL83851",
          "CHEMBL84025",
          "CHEMBL84089",
          "CHEMBL84150",
          "CHEMBL84407",
          "CHEMBL84552",
          "CHEMBL8747",
          "CHEMBL89340",
          "CHEMBL89540",
          "CHEMBL89768",
          "CHEMBL89855",
          "CHEMBL89862",
          "CHEMBL90003",
          "CHEMBL90933",
          "CHEMBL95234",
          "CHEMBL95317",
          "CHEMBL95362",
          "CHEMBL96206",
          "CHEMBL96224",
          "CHEMBL96986",
          "CHEMBL97257",
          "CHEMBL97287",
          "CHEMBL97541",
          "CHEMBL97576",
          "CHEMBL98676",
          "CHEMBL99775"
        ],
        "number_of_missing_values": "0"
      },
      {
        "data_type": "numeric",
        "index": "1",
        "is_ignore": "false",
        "is_row_identifier": "false",
        "is_target": "false",
        "name": "FCFP4_1024b985",
        "number_of_missing_values": "0"
      },
      {
        "data_type": "numeric",
        "index": "2",
        "is_ignore": "false",
        "is_row_identifier": "false",
        "is_target": "false",
        "name": "FCFP4_1024b632",
        "number_of_missing_values": "0"
      },
      {
        "data_type": "numeric",
        "index": "3",
        "is_ignore": "false",
        "is_row_identifier": "false",
        "is_target": "false",
        "name": "FCFP4_1024b1007",
        "number_of_missing_values": "0"
      },
      {
        "data_type": "numeric",
        "index": "4",
        "is_ignore": "false",
        "is_row_identifier": "false",
        "is_target": "false",
        "name": "FCFP4_1024b942",
        "number_of_missing_values": "0"
      },
      {
        "data_type": "numeric",
        "index": "5",
        "is_ignore": "false",
        "is_row_identifier": "false",
        "is_target": "false",
        "name": "FCFP4_1024b406",
        "number_of_missing_values": "0"
      },
      {
        "data_type": "numeric",
        "index": "6",
        "is_ignore": "false",
        "is_row_identifier": "false",
        "is_target": "false",
        "name": "FCFP4_1024b33",
        "number_of_missing_values": "0"
      },
      {
        "data_type": "numeric",
        "index": "7",
        "is_ignore": "false",
        "is_row_identifier": "false",
        "is_target": "false",
        "name": "FCFP4_1024b953",
        "number_of_missing_values": "0"
      },
      {
        "data_type": "numeric",
        "index": "8",
        "is_ignore": "false",
        "is_row_identifier": "false",
        "is_target": "false",
        "name": "FCFP4_1024b702",
        "number_of_missing_values": "0"
      },
      {
        "data_type": "numeric",
        "index": "9",
        "is_ignore": "false",
        "is_row_identifier": "false",
        "is_target": "false",
        "name": "FCFP4_1024b357",
        "number_of_missing_values": "0"
      },
      {
        "data_type": "numeric",
        "index": "10",
        "is_ignore": "false",
        "is_row_identifier": "false",
        "is_target": "false",
        "name": "FCFP4_1024b983",
        "number_of_missing_values": "0"
      },
      {
        "data_type": "numeric",
        "index": "11",
        "is_ignore": "false",
        "is_row_identifier": "false",
        "is_target": "false",
        "name": "FCFP4_1024b65",
        "number_of_missing_values": "0"
      },
      {
        "data_type": "numeric",
        "index": "12",
        "is_ignore": "false",
        "is_row_identifier": "false",
        "is_target": "false",
        "name": "FCFP4_1024b57",
        "number_of_missing_values": "0"
      },
      {
        "data_type": "numeric",
        "index": "13",
        "is_ignore": "false",
        "is_row_identifier": "false",
        "is_target": "false",
        "name": "FCFP4_1024b971",
        "number_of_missing_values": "0"
      },
      {
        "data_type": "numeric",
        "index": "14",
        "is_ignore": "false",
        "is_row_identifier": "false",
        "is_target": "false",
        "name": "FCFP4_1024b54",
        "number_of_missing_values": "0"
      },
      {
        "data_type": "numeric",
        "index": "15",
        "is_ignore": "false",
        "is_row_identifier": "false",
        "is_target": "false",
        "name": "FCFP4_1024b970",
        "number_of_missing_values": "0"
      },
      {
        "data_type": "numeric",
        "index": "16",
        "is_ignore": "false",
        "is_row_identifier": "false",
        "is_target": "false",
        "name": "FCFP4_1024b107",
        "number_of_missing_values": "0"
      },
      {
        "data_type": "numeric",
        "index": "17",
        "is_ignore": "false",
        "is_row_identifier": "false",
        "is_target": "false",
        "name": "FCFP4_1024b453",
        "number_of_missing_values": "0"
      },
      {
        "data_type": "numeric",
        "index": "18",
        "is_ignore": "false",
        "is_row_identifier": "false",
        "is_target": "false",
        "name": "FCFP4_1024b319",
        "number_of_missing_values": "0"
      },
      {
        "data_type": "numeric",
        "index": "19",
        "is_ignore": "false",
        "is_row_identifier": "false",
        "is_target": "false",
        "name": "FCFP4_1024b245",
        "number_of_missing_values": "0"
      },
      {
        "data_type": "numeric",
        "index": "20",
        "is_ignore": "false",
        "is_row_identifier": "false",
        "is_target": "false",
        "name": "FCFP4_1024b71",
        "number_of_missing_values": "0"
      },
      {
        "data_type": "numeric",
        "index": "21",
        "is_ignore": "false",
        "is_row_identifier": "false",
        "is_target": "false",
        "name": "FCFP4_1024b600",
        "number_of_missing_values": "0"
      },
      {
        "data_type": "numeric",
        "index": "22",
        "is_ignore": "false",
        "is_row_identifier": "false",
        "is_target": "false",
        "name": "FCFP4_1024b649",
        "number_of_missing_values": "0"
      },
      {
        "data_type": "numeric",
        "index": "23",
        "is_ignore": "false",
        "is_row_identifier": "false",
        "is_target": "false",
        "name": "FCFP4_1024b37",
        "number_of_missing_values": "0"
      },
      {
        "data_type": "numeric",
        "index": "24",
        "is_ignore": "false",
        "is_row_identifier": "false",
        "is_target": "false",
        "name": "FCFP4_1024b271",
        "number_of_missing_values": "0"
      },
      {
        "data_type": "numeric",
        "index": "25",
        "is_ignore": "false",
        "is_row_identifier": "false",
        "is_target": "false",
        "name": "FCFP4_1024b680",
        "number_of_missing_values": "0"
      },
      {
        "data_type": "numeric",
        "index": "26",
        "is_ignore": "false",
        "is_row_identifier": "false",
        "is_target": "false",
        "name": "FCFP4_1024b139",
        "number_of_missing_values": "0"
      },
      {
        "data_type": "numeric",
        "index": "27",
        "is_ignore": "false",
        "is_row_identifier": "false",
        "is_target": "false",
        "name": "FCFP4_1024b218",
        "number_of_missing_values": "0"
      },
      {
        "data_type": "numeric",
        "index": "28",
        "is_ignore": "false",
        "is_row_identifier": "false",
        "is_target": "false",
        "name": "FCFP4_1024b698",
        "number_of_missing_values": "0"
      },
      {
        "data_type": "numeric",
        "index": "29",
        "is_ignore": "false",
        "is_row_identifier": "false",
        "is_target": "false",
        "name": "FCFP4_1024b77",
        "number_of_missing_values": "0"
      },
      {
        "data_type": "numeric",
        "index": "30",
        "is_ignore": "false",
        "is_row_identifier": "false",
        "is_target": "false",
        "name": "FCFP4_1024b18",
        "number_of_missing_values": "0"
      },
      {
        "data_type": "numeric",
        "index": "31",
        "is_ignore": "false",
        "is_row_identifier": "false",
        "is_target": "false",
        "name": "FCFP4_1024b1010",
        "number_of_missing_values": "0"
      },
      {
        "data_type": "numeric",
        "index": "32",
        "is_ignore": "false",
        "is_row_identifier": "false",
        "is_target": "false",
        "name": "FCFP4_1024b461",
        "number_of_missing_values": "0"
      },
      {
        "data_type": "numeric",
        "index": "33",
        "is_ignore": "false",
        "is_row_identifier": "false",
        "is_target": "false",
        "name": "FCFP4_1024b634",
        "number_of_missing_values": "0"
      },
      {
        "data_type": "numeric",
        "index": "34",
        "is_ignore": "false",
        "is_row_identifier": "false",
        "is_target": "false",
        "name": "FCFP4_1024b925",
        "number_of_missing_values": "0"
      },
      {
        "data_type": "numeric",
        "index": "35",
        "is_ignore": "false",
        "is_row_identifier": "false",
        "is_target": "false",
        "name": "FCFP4_1024b574",
        "number_of_missing_values": "0"
      },
      {
        "data_type": "numeric",
        "index": "36",
        "is_ignore": "false",
        "is_row_identifier": "false",
        "is_target": "false",
        "name": "FCFP4_1024b527",
        "number_of_missing_values": "0"
      },
      {
        "data_type": "numeric",
        "index": "37",
        "is_ignore": "false",
        "is_row_identifier": "false",
        "is_target": "false",
        "name": "FCFP4_1024b617",
        "number_of_missing_values": "0"
      },
      {
        "data_type": "numeric",
        "index": "38",
        "is_ignore": "false",
        "is_row_identifier": "false",
        "is_target": "false",
        "name": "FCFP4_1024b752",
        "number_of_missing_values": "0"
      },
      {
        "data_type": "numeric",
        "index": "39",
        "is_ignore": "false",
        "is_row_identifier": "false",
        "is_target": "false",
        "name": "FCFP4_1024b867",
        "number_of_missing_values": "0"
      },
      {
        "data_type": "numeric",
        "index": "40",
        "is_ignore": "false",
        "is_row_identifier": "false",
        "is_target": "false",
        "name": "FCFP4_1024b557",
        "number_of_missing_values": "0"
      },
      {
        "data_type": "numeric",
        "index": "41",
        "is_ignore": "false",
        "is_row_identifier": "false",
        "is_target": "false",
        "name": "FCFP4_1024b745",
        "number_of_missing_values": "0"
      },
      {
        "data_type": "numeric",
        "index": "42",
        "is_ignore": "false",
        "is_row_identifier": "false",
        "is_target": "false",
        "name": "FCFP4_1024b492",
        "number_of_missing_values": "0"
      },
      {
        "data_type": "numeric",
        "index": "43",
        "is_ignore": "false",
        "is_row_identifier": "false",
        "is_target": "false",
        "name": "FCFP4_1024b128",
        "number_of_missing_values": "0"
      },
      {
        "data_type": "numeric",
        "index": "44",
        "is_ignore": "false",
        "is_row_identifier": "false",
        "is_target": "false",
        "name": "FCFP4_1024b102",
        "number_of_missing_values": "0"
      },
      {
        "data_type": "numeric",
        "index": "45",
        "is_ignore": "false",
        "is_row_identifier": "false",
        "is_target": "false",
        "name": "FCFP4_1024b375",
        "number_of_missing_values": "0"
      },
      {
        "data_type": "numeric",
        "index": "46",
        "is_ignore": "false",
        "is_row_identifier": "false",
        "is_target": "false",
        "name": "FCFP4_1024b1021",
        "number_of_missing_values": "0"
      },
      {
        "data_type": "numeric",
        "index": "47",
        "is_ignore": "false",
        "is_row_identifier": "false",
        "is_target": "false",
        "name": "FCFP4_1024b394",
        "number_of_missing_values": "0"
      },
      {
        "data_type": "numeric",
        "index": "48",
        "is_ignore": "false",
        "is_row_identifier": "false",
        "is_target": "false",
        "name": "FCFP4_1024b252",
        "number_of_missing_values": "0"
      },
      {
        "data_type": "numeric",
        "index": "49",
        "is_ignore": "false",
        "is_row_identifier": "false",
        "is_target": "false",
        "name": "FCFP4_1024b769",
        "number_of_missing_values": "0"
      },
      {
        "data_type": "numeric",
        "index": "50",
        "is_ignore": "false",
        "is_row_identifier": "false",
        "is_target": "false",
        "name": "FCFP4_1024b424",
        "number_of_missing_values": "0"
      },
      {
        "data_type": "numeric",
        "index": "51",
        "is_ignore": "false",
        "is_row_identifier": "false",
        "is_target": "false",
        "name": "FCFP4_1024b534",
        "number_of_missing_values": "0"
      },
      {
        "data_type": "numeric",
        "index": "52",
        "is_ignore": "false",
        "is_row_identifier": "false",
        "is_target": "false",
        "name": "FCFP4_1024b347",
        "number_of_missing_values": "0"
      },
      {
        "data_type": "numeric",
        "index": "53",
        "is_ignore": "false",
        "is_row_identifier": "false",
        "is_target": "false",
        "name": "FCFP4_1024b1",
        "number_of_missing_values": "0"
      },
      {
        "data_type": "numeric",
        "index": "54",
        "is_ignore": "false",
        "is_row_identifier": "false",
        "is_target": "false",
        "name": "FCFP4_1024b10",
        "number_of_missing_values": "0"
      },
      {
        "data_type": "numeric",
        "index": "55",
        "is_ignore": "false",
        "is_row_identifier": "false",
        "is_target": "false",
        "name": "FCFP4_1024b100",
        "number_of_missing_values": "0"
      },
      {
        "data_type": "numeric",
        "index": "56",
        "is_ignore": "false",
        "is_row_identifier": "false",
        "is_target": "false",
        "name": "FCFP4_1024b1000",
        "number_of_missing_values": "0"
      },
      {
        "data_type": "numeric",
        "index": "57",
        "is_ignore": "false",
        "is_row_identifier": "false",
        "is_target": "false",
        "name": "FCFP4_1024b1001",
        "number_of_missing_values": "0"
      },
      {
        "data_type": "numeric",
        "index": "58",
        "is_ignore": "false",
        "is_row_identifier": "false",
        "is_target": "false",
        "name": "FCFP4_1024b1002",
        "number_of_missing_values": "0"
      },
      {
        "data_type": "numeric",
        "index": "59",
        "is_ignore": "false",
        "is_row_identifier": "false",
        "is_target": "false",
        "name": "FCFP4_1024b1003",
        "number_of_missing_values": "0"
      },
      {
        "data_type": "numeric",
        "index": "60",
        "is_ignore": "false",
        "is_row_identifier": "false",
        "is_target": "false",
        "name": "FCFP4_1024b1004",
        "number_of_missing_values": "0"
      },
      {
        "data_type": "numeric",
        "index": "61",
        "is_ignore": "false",
        "is_row_identifier": "false",
        "is_target": "false",
        "name": "FCFP4_1024b1005",
        "number_of_missing_values": "0"
      },
      {
        "data_type": "numeric",
        "index": "62",
        "is_ignore": "false",
        "is_row_identifier": "false",
        "is_target": "false",
        "name": "FCFP4_1024b1006",
        "number_of_missing_values": "0"
      },
      {
        "data_type": "numeric",
        "index": "63",
        "is_ignore": "false",
        "is_row_identifier": "false",
        "is_target": "false",
        "name": "FCFP4_1024b1008",
        "number_of_missing_values": "0"
      },
      {
        "data_type": "numeric",
        "index": "64",
        "is_ignore": "false",
        "is_row_identifier": "false",
        "is_target": "false",
        "name": "FCFP4_1024b1009",
        "number_of_missing_values": "0"
      },
      {
        "data_type": "numeric",
        "index": "65",
        "is_ignore": "false",
        "is_row_identifier": "false",
        "is_target": "false",
        "name": "FCFP4_1024b101",
        "number_of_missing_values": "0"
      },
      {
        "data_type": "numeric",
        "index": "66",
        "is_ignore": "false",
        "is_row_identifier": "false",
        "is_target": "false",
        "name": "FCFP4_1024b1011",
        "number_of_missing_values": "0"
      },
      {
        "data_type": "numeric",
        "index": "67",
        "is_ignore": "false",
        "is_row_identifier": "false",
        "is_target": "false",
        "name": "FCFP4_1024b1012",
        "number_of_missing_values": "0"
      },
      {
        "data_type": "numeric",
        "index": "68",
        "is_ignore": "false",
        "is_row_identifier": "false",
        "is_target": "false",
        "name": "FCFP4_1024b1013",
        "number_of_missing_values": "0"
      },
      {
        "data_type": "numeric",
        "index": "69",
        "is_ignore": "false",
        "is_row_identifier": "false",
        "is_target": "false",
        "name": "FCFP4_1024b1014",
        "number_of_missing_values": "0"
      },
      {
        "data_type": "numeric",
        "index": "70",
        "is_ignore": "false",
        "is_row_identifier": "false",
        "is_target": "false",
        "name": "FCFP4_1024b1015",
        "number_of_missing_values": "0"
      },
      {
        "data_type": "numeric",
        "index": "71",
        "is_ignore": "false",
        "is_row_identifier": "false",
        "is_target": "false",
        "name": "FCFP4_1024b1016",
        "number_of_missing_values": "0"
      },
      {
        "data_type": "numeric",
        "index": "72",
        "is_ignore": "false",
        "is_row_identifier": "false",
        "is_target": "false",
        "name": "FCFP4_1024b1017",
        "number_of_missing_values": "0"
      },
      {
        "data_type": "numeric",
        "index": "73",
        "is_ignore": "false",
        "is_row_identifier": "false",
        "is_target": "false",
        "name": "FCFP4_1024b1018",
        "number_of_missing_values": "0"
      },
      {
        "data_type": "numeric",
        "index": "74",
        "is_ignore": "false",
        "is_row_identifier": "false",
        "is_target": "false",
        "name": "FCFP4_1024b1019",
        "number_of_missing_values": "0"
      },
      {
        "data_type": "numeric",
        "index": "75",
        "is_ignore": "false",
        "is_row_identifier": "false",
        "is_target": "false",
        "name": "FCFP4_1024b1020",
        "number_of_missing_values": "0"
      },
      {
        "data_type": "numeric",
        "index": "76",
        "is_ignore": "false",
        "is_row_identifier": "false",
        "is_target": "false",
        "name": "FCFP4_1024b1022",
        "number_of_missing_values": "0"
      },
      {
        "data_type": "numeric",
        "index": "77",
        "is_ignore": "false",
        "is_row_identifier": "false",
        "is_target": "false",
        "name": "FCFP4_1024b1023",
        "number_of_missing_values": "0"
      },
      {
        "data_type": "numeric",
        "index": "78",
        "is_ignore": "false",
        "is_row_identifier": "false",
        "is_target": "false",
        "name": "FCFP4_1024b1024",
        "number_of_missing_values": "0"
      },
      {
        "data_type": "numeric",
        "index": "79",
        "is_ignore": "false",
        "is_row_identifier": "false",
        "is_target": "false",
        "name": "FCFP4_1024b103",
        "number_of_missing_values": "0"
      },
      {
        "data_type": "numeric",
        "index": "80",
        "is_ignore": "false",
        "is_row_identifier": "false",
        "is_target": "false",
        "name": "FCFP4_1024b104",
        "number_of_missing_values": "0"
      },
      {
        "data_type": "numeric",
        "index": "81",
        "is_ignore": "false",
        "is_row_identifier": "false",
        "is_target": "false",
        "name": "FCFP4_1024b105",
        "number_of_missing_values": "0"
      },
      {
        "data_type": "numeric",
        "index": "82",
        "is_ignore": "false",
        "is_row_identifier": "false",
        "is_target": "false",
        "name": "FCFP4_1024b106",
        "number_of_missing_values": "0"
      },
      {
        "data_type": "numeric",
        "index": "83",
        "is_ignore": "false",
        "is_row_identifier": "false",
        "is_target": "false",
        "name": "FCFP4_1024b108",
        "number_of_missing_values": "0"
      },
      {
        "data_type": "numeric",
        "index": "84",
        "is_ignore": "false",
        "is_row_identifier": "false",
        "is_target": "false",
        "name": "FCFP4_1024b109",
        "number_of_missing_values": "0"
      },
      {
        "data_type": "numeric",
        "index": "85",
        "is_ignore": "false",
        "is_row_identifier": "false",
        "is_target": "false",
        "name": "FCFP4_1024b11",
        "number_of_missing_values": "0"
      },
      {
        "data_type": "numeric",
        "index": "86",
        "is_ignore": "false",
        "is_row_identifier": "false",
        "is_target": "false",
        "name": "FCFP4_1024b110",
        "number_of_missing_values": "0"
      },
      {
        "data_type": "numeric",
        "index": "87",
        "is_ignore": "false",
        "is_row_identifier": "false",
        "is_target": "false",
        "name": "FCFP4_1024b111",
        "number_of_missing_values": "0"
      },
      {
        "data_type": "numeric",
        "index": "88",
        "is_ignore": "false",
        "is_row_identifier": "false",
        "is_target": "false",
        "name": "FCFP4_1024b112",
        "number_of_missing_values": "0"
      },
      {
        "data_type": "numeric",
        "index": "89",
        "is_ignore": "false",
        "is_row_identifier": "false",
        "is_target": "false",
        "name": "FCFP4_1024b113",
        "number_of_missing_values": "0"
      },
      {
        "data_type": "numeric",
        "index": "90",
        "is_ignore": "false",
        "is_row_identifier": "false",
        "is_target": "false",
        "name": "FCFP4_1024b114",
        "number_of_missing_values": "0"
      },
      {
        "data_type": "numeric",
        "index": "91",
        "is_ignore": "false",
        "is_row_identifier": "false",
        "is_target": "false",
        "name": "FCFP4_1024b115",
        "number_of_missing_values": "0"
      },
      {
        "data_type": "numeric",
        "index": "92",
        "is_ignore": "false",
        "is_row_identifier": "false",
        "is_target": "false",
        "name": "FCFP4_1024b116",
        "number_of_missing_values": "0"
      },
      {
        "data_type": "numeric",
        "index": "93",
        "is_ignore": "false",
        "is_row_identifier": "false",
        "is_target": "false",
        "name": "FCFP4_1024b117",
        "number_of_missing_values": "0"
      },
      {
        "data_type": "numeric",
        "index": "94",
        "is_ignore": "false",
        "is_row_identifier": "false",
        "is_target": "false",
        "name": "FCFP4_1024b118",
        "number_of_missing_values": "0"
      },
      {
        "data_type": "numeric",
        "index": "95",
        "is_ignore": "false",
        "is_row_identifier": "false",
        "is_target": "false",
        "name": "FCFP4_1024b119",
        "number_of_missing_values": "0"
      },
      {
        "data_type": "numeric",
        "index": "96",
        "is_ignore": "false",
        "is_row_identifier": "false",
        "is_target": "false",
        "name": "FCFP4_1024b12",
        "number_of_missing_values": "0"
      },
      {
        "data_type": "numeric",
        "index": "97",
        "is_ignore": "false",
        "is_row_identifier": "false",
        "is_target": "false",
        "name": "FCFP4_1024b120",
        "number_of_missing_values": "0"
      },
      {
        "data_type": "numeric",
        "index": "98",
        "is_ignore": "false",
        "is_row_identifier": "false",
        "is_target": "false",
        "name": "FCFP4_1024b121",
        "number_of_missing_values": "0"
      },
      {
        "data_type": "numeric",
        "index": "99",
        "is_ignore": "false",
        "is_row_identifier": "false",
        "is_target": "false",
        "name": "FCFP4_1024b122",
        "number_of_missing_values": "0"
      },
      {
        "data_type": "numeric",
        "index": "100",
        "is_ignore": "false",
        "is_row_identifier": "false",
        "is_target": "false",
        "name": "FCFP4_1024b123",
        "number_of_missing_values": "0"
      },
      {
        "data_type": "numeric",
        "index": "101",
        "is_ignore": "false",
        "is_row_identifier": "false",
        "is_target": "false",
        "name": "FCFP4_1024b124",
        "number_of_missing_values": "0"
      },
      {
        "data_type": "numeric",
        "index": "102",
        "is_ignore": "false",
        "is_row_identifier": "false",
        "is_target": "false",
        "name": "FCFP4_1024b125",
        "number_of_missing_values": "0"
      },
      {
        "data_type": "numeric",
        "index": "103",
        "is_ignore": "false",
        "is_row_identifier": "false",
        "is_target": "true",
        "name": "pXC50",
        "number_of_missing_values": "0"
      }
    ]
  }
}