"molecule_id","Me","AMW","C.","H.","pXC50"
{1 1.01,2 7.565,3 41.3,4 44.4,5 4.383}
{0 CHEMBL1350514,1 1.01,2 7.565,3 41.3,4 44.4,5 4.414}
{0 CHEMBL1774322,1 0.999,2 9.034,3 47.8,4 37,5 4.234}
{0 CHEMBL1774323,1 1.004,2 6.995,3 39.1,4 49.3,5 4.202}
{0 CHEMBL1774325,1 1.014,2 7.956,3 44.6,4 41.1,5 4.113}
{0 CHEMBL1774326,1 1.008,2 8.401,3 40.7,4 42.4,5 4.042}
{0 CHEMBL492571,1 1.016,2 8.036,3 45.9,4 40.5,5 4.301}
{0 CHEMBL492768,1 1.023,2 8.286,3 47.2,4 38.9,5 4.392}
{0 CHEMBL492769,1 1.032,2 9.243,3 47.2,4 36.1,5 4.301}
{0 CHEMBL492770,1 1.023,2 8.286,3 47.2,4 38.9,5 4.301}
{0 CHEMBL492771,1 1.032,2 9.243,3 47.2,4 36.1,5 4.74}
{0 CHEMBL492772,1 1.032,2 9.243,3 47.2,4 36.1,5 4.422}
{0 CHEMBL499444,1 1.023,2 8.286,3 47.2,4 38.9,5 4.301}
{0 CHEMBL50,1 1.053,2 9.445,3 46.9,4 31.3,5 4.301}
{0 CHEMBL522710,1 1.025,2 8.967,3 45.9,4 37.8,5 4.63}
{0 CHEMBL549646,1 1.025,2 8.967,3 45.9,4 37.8,5 4.301}
{0 CHEMBL550256,1 1.037,2 9.485,3 48.9,4 33.3,5 4.68}
{0 CHEMBL551130,1 1.037,2 9.485,3 48.9,4 33.3,5 4.301}
{0 CHEMBL551131,1 1.034,2 9.074,3 50,4 32.6,5 4.595}
{0 CHEMBL551334,1 1.037,2 9.54,3 50,4 32.6,5 4.301}
{0 CHEMBL551529,1 1.034,2 9.136,3 51.1,4 31.9,5 4.368}
{0 CHEMBL556501,1 1.052,2 9.523,3 48.5,4 30.3,5 4.301}
{0 CHEMBL560136,1 1.025,2 8.967,3 45.9,4 37.8,5 4.301}
{0 CHEMBL560392,1 1.021,2 8.483,3 47.4,4 36.8,5 4.301}
{0 CHEMBL560933,1 1.037,2 9.54,3 50,4 32.6,5 4.557}
