{
  "data_set_description": {
    "collection_date": "November 2013",
    "creator": "Dr Jeremy Besnard, Dr Ivan Olier, Dr Noureddin Sadawi, Dr Larisa Soldatova, Dr Crina Grosan, Prof Ross King, Dr Richard Bickerton, Prof Andrew Hopkins and Dr Willem van Hoorn",
    "default_target_attribute": "pXC50",
    "description": "This dataset contains QSAR data (from ChEMBL version 17) showing activity values (unit is pseudo-pCI50) of several compounds on drug target ChEMBL_ID: CHEMBL1921666 (TID: 104382), and it has 26 rows and 1201 features (not including molecule IDs and class feature: molecule_id and pXC50). The features represent Molecular Descriptors which were generated from SMILES strings. Missing value imputation was applied to this dataset (By choosing the Median).",
    "description_version": "1",
    "file_id": "3418968",
    "format": "ARFF",
    "id": "30408",
    "licence": "Public",
    "md5_checksum": "9dce6ce1fc84a24b000724c18ceaffe3",
    "minio_url": "https://data.openml.org/datasets/0003/30408/dataset_30408.pq",
    "name": "QSAR-DATASET-FOR-DRUG-TARGET-CHEMBL1921666",
    "original_data_url": "https://www.ebi.ac.uk/chembl/target/inspect/CHEMBL1921666",
    "parquet_url": "https://data.openml.org/datasets/0003/30408/dataset_30408.pq",
    "processing_date": "2018-10-04 01:50:13",
    "row_id_attribute": "molecule_id",
    "status": "deactivated",
    "tag": [
      "MetaQSAR",
      "study_13"
    ],
    "upload_date": "2016-07-15T04:55:51",
    "url": "https://api.openml.org/data/v1/download/3418968/QSAR-DATASET-FOR-DRUG-TARGET-CHEMBL1921666.arff",
    "version": "9",
    "visibility": "public"
  }
}