"molecule_id","nDB","O.","nCsp3","RBF","AMW","Sv","pXC50"
{3 5,4 0.095,5 7.111,6 24.971,7 4.77}
{0 CHEMBL1201102,3 6,4 0.089,5 8.197,6 27.648,7 4.77}
{0 CHEMBL1276946,1 4,2 4.9,3 2,4 0.068,5 8.947,6 28.504,7 6.783}
{0 CHEMBL1300506,3 1,5 8.231,6 22.369,7 5.832}
{0 CHEMBL1314026,1 3,2 7.1,4 0.138,5 11.112,6 20.751,7 4.77}
{0 CHEMBL1314049,1 1,2 3,3 1,4 0.147,5 9.493,6 22.473,7 4.77}
{0 CHEMBL1314074,1 5,2 16.7,4 0.161,5 9.575,6 21.219,7 4.77}
{0 CHEMBL1314111,1 1,4 0.111,5 13.389,6 19.73,7 4.77}
{0 CHEMBL1314149,1 1,4 0.111,5 10.236,6 18.826,7 4.77}
{0 CHEMBL1314294,1 2,2 7.1,3 1,4 0.136,5 10.445,6 30.379,7 4.77}
{0 CHEMBL1314554,1 4,2 11.4,3 4,4 0.13,5 10.789,6 31.324,7 4.77}
{0 CHEMBL1315444,1 1,2 3.7,4 0.107,5 16.293,6 21.592,7 4.301}
{0 CHEMBL1316039,1 1,4 0.107,5 7.269,6 17.677,7 4.884}
{0 CHEMBL1318312,1 2,2 2.9,3 1,4 0.056,5 8.306,6 23.106,7 5.624}
{0 CHEMBL1318391,1 1,2 11.1,4 0.053,5 11.814,6 14.025,7 4.77}
{0 CHEMBL1318543,1 1,2 5.1,4 0.098,5 8.687,6 26.988,7 4.77}
{0 CHEMBL1323615,3 1,5 8.155,6 18.864,7 7.357}
{0 CHEMBL1325140,1 2,2 5.6,3 2,4 0.135,5 7.454,6 23.16,7 4.77}
{0 CHEMBL1329357,1 2,2 10.3,3 1,4 0.032,5 9.011,6 19.987,7 4.5}
{0 CHEMBL1330018,1 1,2 2.7,3 2,4 0.077,5 8.471,6 24.643,7 6.728}
{0 CHEMBL1331532,1 2,2 4.5,3 1,4 0.085,5 8.534,6 30.369,7 7.276}
{0 CHEMBL1331821,2 3.7,3 1,4 0.034,5 8.493,6 18.557,7 4.699}
{0 CHEMBL1331838,1 1,2 4.5,3 2,4 0.063,5 10.421,6 32.684,7 4.301}
{0 CHEMBL1331887,1 1,2 2.4,3 2,4 0.068,5 7.272,6 26.993,7 6.333}
{0 CHEMBL1332171,1 3,2 7.5,3 2,4 0.095,5 8.511,6 27.062,7 4.301}
{0 CHEMBL1332917,1 2,2 5.6,3 2,4 0.135,5 7.454,6 23.16,7 4.77}
{0 CHEMBL1334632,1 2,2 8,5 9.252,6 17.745,7 4.301}
{0 CHEMBL1342313,1 2,4 0.086,5 8.896,6 23.094,7 6.494}
{0 CHEMBL1348462,1 1,2 6.1,4 0.111,5 10.812,6 25.11,7 4.77}
{0 CHEMBL1349751,1 2,2 2.4,3 1,4 0.044,5 9.463,6 30.288,7 4.301}
{0 CHEMBL1350157,1 2,2 4.3,3 5,4 0.125,5 6.924,6 28.762,7 7.081}
{0 CHEMBL1353985,1 2,2 4.5,3 1,4 0.085,5 8.534,6 30.369,7 6.516}
{0 CHEMBL1354115,3 1,5 14.273,6 19.893,7 4.301}
{0 CHEMBL1354139,2 3.3,3 2,4 0.031,5 8.112,6 20.084,7 6.439}
{0 CHEMBL1354164,2 4.3,3 2,4 0.1,5 7.584,6 31.214,7 4.77}
{0 CHEMBL1354183,2 4.8,3 1,4 0.043,5 8.105,6 29.16,7 5.938}
{0 CHEMBL1354204,1 1,2 9.4,3 1,4 0.118,5 9.962,6 23.32,7 4.77}
{0 CHEMBL1354497,1 3,2 13.3,4 0.125,5 11.125,6 23.002,7 4.77}
{0 CHEMBL1354612,3 1,4 0.034,5 9.089,6 19.03,7 6.618}
{0 CHEMBL1355341,2 4.5,3 1,4 0.085,5 7.782,6 29.687,7 4.77}
{0 CHEMBL1355822,1 1,2 3.7,3 1,5 10.492,6 19.707,7 4.77}
{0 CHEMBL1356469,1 1,2 2.6,3 1,4 0.049,5 8.353,6 26.611,7 4.699}
{0 CHEMBL1357284,1 3,2 10,3 1,5 9.111,6 20.987,7 4.699}
{0 CHEMBL1358377,1 2,2 6.4,3 2,4 0.122,5 9.347,6 31.954,7 4.77}
{0 CHEMBL1358723,1 1,2 3.2,3 1,4 0.125,5 10.633,6 22.401,7 4.77}
{0 CHEMBL1362864,1 1,2 3.2,3 2,4 0.03,5 8.237,6 21.084,7 5.627}
{0 CHEMBL1377821,1 1,2 2.4,3 4,4 0.116,5 6.748,6 25.52,7 6.754}
{0 CHEMBL1393937,2 7.3,3 4,4 0.121,5 7.573,6 35.697,7 4.77}
{0 CHEMBL1393979,3 1,5 11.239,6 18.868,7 4.301}
{0 CHEMBL1394037,1 2,2 4.5,3 1,4 0.085,5 8.534,6 30.369,7 6.251}
{0 CHEMBL1394054,1 2,2 10.5,3 2,4 0.125,5 10.965,6 27.567,7 4.77}
{0 CHEMBL1394104,1 1,2 2.5,3 3,4 0.098,5 7.536,6 25.181,7 5.921}
{0 CHEMBL1395104,1 1,2 2.5,3 1,4 0.047,5 8.311,6 27.632,7 6.697}
{0 CHEMBL1395493,1 4,3 1,4 0.063,5 9.845,6 21.864,7 5.152}
{0 CHEMBL1395784,1 3,2 9.5,3 1,4 0.136,5 8.295,6 28.59,7 4.77}
{0 CHEMBL1396515,1 1,2 4.2,5 8.97,6 17.031,7 4.699}
{0 CHEMBL1396694,1 1,2 7.1,4 0.1,5 10.955,6 21.462,7 4.77}
{0 CHEMBL1397941,1 1,2 3.6,3 5,4 0.138,5 6.956,6 34.815,7 6.628}
{0 CHEMBL1398496,1 1,2 9.4,3 1,4 0.118,5 9.962,6 23.32,7 4.77}
{0 CHEMBL1400134,1 1,2 4.7,3 5,4 0.087,5 8.649,6 29.207,7 4.955}
{0 CHEMBL1401860,1 1,2 5.9,3 2,4 0.083,5 8.423,6 22.82,7 6.038}
{0 CHEMBL1404241,1 1,2 2.2,3 5,4 0.109,5 7.809,6 28.197,7 6.451}
{0 CHEMBL1408592,1 2,2 6.7,3 4,4 0.109,5 7.276,6 27.95,7 4.699}
{0 CHEMBL1408679,1 2,2 4.5,3 1,4 0.064,5 8.534,6 30.369,7 6.418}
{0 CHEMBL1409343,1 3,2 6.9,4 0.133,5 11.882,6 22.084,7 4.77}
{0 CHEMBL1411769,5 10.162,6 17.143,7 6.596}
{0 CHEMBL1413226,1 1,2 9.4,3 1,4 0.118,5 9.962,6 23.32,7 4.77}
{0 CHEMBL1425567,1 1,2 6.3,4 0.029,5 9.168,6 23.272,7 5.196}
{0 CHEMBL1433287,1 1,2 3.6,4 0.103,5 10.041,6 20.047,7 4.77}
{0 CHEMBL1433288,1 3,2 13.3,4 0.125,5 11.125,6 23.002,7 4.77}
{0 CHEMBL1433366,1 2,2 5.1,3 1,4 0.048,5 9.947,6 28.34,7 5.28}
{0 CHEMBL1433370,1 2,2 2.9,3 1,4 0.114,5 7.451,6 21.94,7 5.206}
{0 CHEMBL1433379,1 3,2 2.4,3 1,4 0.067,5 8.892,6 29.643,7 4.753}
{0 CHEMBL1433380,3 2,4 0.032,5 10.215,6 21.024,7 4.301}
{0 CHEMBL1433381,1 3,2 11.1,3 1,4 0.128,5 8.431,6 30.326,7 4.77}
{0 CHEMBL1433416,1 2,2 6.9,4 0.133,5 11.882,6 22.084,7 4.77}
{0 CHEMBL1433973,1 1,2 3.5,3 6,4 0.1,5 7.045,6 35.815,7 4.77}
{0 CHEMBL1434013,1 3,2 7.8,3 3,4 0.093,5 8.305,6 33.852,7 4.77}
{0 CHEMBL1434086,1 2,3 1,4 0.033,5 9.084,6 19.853,7 6.137}
{0 CHEMBL1434402,1 1,2 2.7,4 0.025,5 9.578,6 26.872,7 6.197}
{0 CHEMBL1434483,4 0.075,5 8.064,6 25.72,7 4.77}
{0 CHEMBL1434771,1 2,3 1,4 0.079,5 9.971,6 25.831,7 6.018}
{0 CHEMBL1435967,1 3,2 13.3,4 0.125,5 9.977,6 22.175,7 4.77}
{0 CHEMBL1437772,1 1,2 3.6,3 1,5 8.619,6 19.557,7 5.34}
{0 CHEMBL1449547,1 1,2 5,3 3,4 0.098,5 7.134,6 24.708,7 6.586}
{0 CHEMBL1450360,5 8.598,6 20.843,7 5.12}
{0 CHEMBL1472463,1 2,2 7.1,3 1,4 0.033,5 11.153,6 20.917,7 5.851}
{0 CHEMBL1472474,1 2,2 7,3 1,4 0.117,5 7.957,6 38.191,7 4.77}
{0 CHEMBL1472537,1 1,2 3.2,3 1,4 0.125,5 10.202,6 21.835,7 4.77}
{0 CHEMBL1472557,1 2,2 8.6,3 1,4 0.108,5 10.865,6 26.169,7 4.77}
{0 CHEMBL1472564,1 1,4 0.135,5 10.009,6 24.769,7 4.77}
{0 CHEMBL1472573,2 3.7,3 1,4 0.034,5 9.769,6 19.385,7 6.752}
{0 CHEMBL1473057,1 1,2 9.1,4 0.111,5 10.812,6 25.309,7 4.77}
{0 CHEMBL1473456,1 1,2 4,3 3,4 0.115,5 7.23,6 31.762,7 5.662}
{0 CHEMBL1475468,1 2,2 5.6,3 2,4 0.135,5 8.453,6 23.927,7 4.77}
{0 CHEMBL1476649,1 1,2 8.6,3 2,4 0.139,5 9.865,6 23.903,7 5.531}
{0 CHEMBL1489079,5 8.367,6 19.666,7 5.456}
{0 CHEMBL1511840,1 3,2 2.5,3 1,4 0.07,5 8.961,6 28.622,7 4.699}
{0 CHEMBL1511877,1 3,2 9.8,4 0.116,5 9.361,6 28.912,7 4.77}
{0 CHEMBL1511878,1 1,2 5.9,4 0.081,5 9.965,6 25.605,7 4.77}
{0 CHEMBL1511904,1 1,2 7.1,4 0.1,5 10.955,6 21.462,7 4.77}
{0 CHEMBL1511928,1 2,2 5.9,4 0.086,5 9.976,6 23.804,7 4.77}
{0 CHEMBL1511945,2 2.6,4 0.073,5 7.826,6 26.424,7 4.77}
{0 CHEMBL1511947,1 2,2 9.1,4 0.147,5 11.352,6 24.325,7 5.352}
{0 CHEMBL1511987,1 1,2 7.1,4 0.1,5 11.543,6 21.906,7 4.77}
{0 CHEMBL1513460,1 2,2 7,3 4,4 0.067,5 7.567,6 27.423,7 4.77}
{0 CHEMBL1514168,1 2,2 8.3,3 2,4 0.135,5 8.122,6 23.062,7 4.77}
{0 CHEMBL1515783,1 2,2 5.3,3 2,4 0.077,5 8.363,6 25.009,7 4.699}
{0 CHEMBL1515889,1 3,2 13.3,4 0.125,5 9.977,6 22.175,7 4.77}
{0 CHEMBL1516467,1 1,2 7.1,4 0.1,5 10.313,6 21.078,7 4.77}
{0 CHEMBL1517979,1 1,3 2,4 0.114,5 9.095,6 22.901,7 4.301}
{0 CHEMBL1526463,1 2,2 4.3,3 5,4 0.125,5 6.924,6 28.762,7 6.599}
{0 CHEMBL1527096,1 2,2 6.5,3 2,4 0.03,5 8.366,6 20.799,7 4.301}
{0 CHEMBL1528228,1 2,2 3,4 0.086,5 8.981,6 23.095,7 4.77}
{0 CHEMBL1530026,1 1,2 9.4,3 1,4 0.118,5 11.038,6 24.147,7 4.77}
{0 CHEMBL1550870,1 2,4 0.086,5 9.425,6 23.477,7 6.481}
{0 CHEMBL1550872,1 3,2 13.3,4 0.125,5 11.125,6 23.002,7 4.77}
{0 CHEMBL1550969,1 2,2 5.7,3 1,4 0.139,5 10.647,6 25.137,7 4.77}
{0 CHEMBL1550992,1 1,4 0.115,5 10.685,6 18.321,7 4.77}
{0 CHEMBL1550997,1 1,2 2.2,4 0.061,5 8.433,6 32.138,7 4.301}
{0 CHEMBL1550999,1 2,2 12.2,3 3,4 0.167,5 10.602,6 28.808,7 4.77}
{0 CHEMBL1551000,1 1,4 0.111,5 12.885,6 20.481,7 4.77}
{0 CHEMBL1551006,1 1,2 3.3,3 1,4 0.129,5 11.671,6 22.218,7 4.77}
{0 CHEMBL1551019,1 1,2 3.6,4 0.067,5 11.722,6 21.297,7 4.77}
{0 CHEMBL1551996,1 1,2 2.6,3 1,4 0.049,5 10.429,6 27.636,7 4.699}
{0 CHEMBL1552484,1 2,2 4.8,3 1,4 0.044,5 8.582,6 29.347,7 5.807}
{0 CHEMBL1552577,1 1,2 3,3 2,4 0.029,5 9.237,6 22.933,7 6.185}
{0 CHEMBL1552619,1 1,4 0.138,5 10.151,6 19.726,7 4.77}
{0 CHEMBL1553503,1 2,3 2,4 0.135,5 10.26,6 25.76,7 4.77}
{0 CHEMBL1553680,5 9.447,6 16.699,7 6.62}
{0 CHEMBL1554785,1 1,2 2.2,3 1,4 0.082,5 7.684,6 30.993,7 4.77}
{0 CHEMBL1554930,2 5.9,3 3,4 0.111,5 7.578,6 33.455,7 4.77}
{0 CHEMBL1567692,1 1,2 2.8,3 2,4 0.081,5 8.05,6 23.294,7 7.319}
{0 CHEMBL1568527,1 3,2 14.7,3 1,4 0.139,5 10.7,6 25.244,7 4.77}
{0 CHEMBL1568616,2 6.3,3 2,4 0.098,5 7.759,6 31.928,7 5.045}
{0 CHEMBL1589696,1 2,2 6.7,3 4,4 0.128,5 9.861,6 30.927,7 4.77}
{0 CHEMBL1589710,1 1,2 2.6,3 3,4 0.154,5 9.009,6 25.021,7 5.953}
{0 CHEMBL1589730,1 2,2 8.6,3 1,4 0.108,5 9.881,6 25.341,7 4.77}
{0 CHEMBL1589732,1 2,3 2,4 0.073,5 9.985,6 27.802,7 5.455}
{0 CHEMBL1589765,1 3,2 9.1,3 1,4 0.13,5 8.259,6 29.611,7 4.77}
{0 CHEMBL1589775,1 1,4 0.115,5 10.808,6 18.199,7 4.77}
{0 CHEMBL1589810,1 2,4 0.086,5 9.909,6 23.921,7 6.14}
{0 CHEMBL1590058,1 2,2 2.9,3 1,4 0.114,5 10.49,6 24.422,7 4.77}
{0 CHEMBL1591034,1 2,2 3.8,3 1,4 0.071,5 8.395,6 36.401,7 4.301}
{0 CHEMBL1592130,4 0.069,5 8.827,6 19.337,7 4.77}
{0 CHEMBL1593278,1 1,2 7.9,3 3,4 0.154,5 9.374,6 25.551,7 4.77}
{0 CHEMBL1593461,1 3,2 2.5,3 1,4 0.07,5 10.933,6 29.647,7 4.863}
{0 CHEMBL1594059,1 1,2 9.4,3 1,4 0.118,5 8.886,6 22.492,7 4.77}
{0 CHEMBL1596206,1 2,2 7.7,3 3,4 0.073,5 9.304,6 26.889,7 4.301}
{0 CHEMBL1926690,1 4,2 4.2,3 4,4 0.058,5 8.477,6 32.557,7 6.4}
{0 CHEMBL1927145,1 5,2 7.5,3 8,4 0.054,5 8.131,6 34.04,7 6.83}
{0 CHEMBL1927146,1 4,2 5.3,3 4,4 0.024,5 8.705,6 25.504,7 6.924}
{0 CHEMBL1927147,1 4,2 3.9,3 5,4 0.055,5 8.254,6 34.084,7 6.996}
{0 CHEMBL1927148,1 4,2 5.5,3 6,4 0.068,5 7.573,6 35.498,7 6.662}
{0 CHEMBL1927149,1 4,2 3.9,3 5,4 0.055,5 8.929,6 34.911,7 7.06}
{0 CHEMBL1927150,1 4,2 3.9,3 5,4 0.055,5 8.929,6 34.911,7 6.983}
{0 CHEMBL1927151,1 4,2 3.9,3 5,4 0.055,5 8.929,6 34.911,7 7.022}
{0 CHEMBL1927152,1 4,2 5.5,3 6,4 0.068,5 8.199,6 36.325,7 6.876}
{0 CHEMBL1927153,1 4,2 5.5,3 6,4 0.068,5 8.199,6 36.325,7 6.947}
{0 CHEMBL1927154,1 4,2 5.5,3 6,4 0.068,5 8.199,6 36.325,7 6.735}
{0 CHEMBL1927155,1 4,2 6.3,3 5,4 0.058,5 8.56,6 32.272,7 6.699}
{0 CHEMBL1927156,1 4,2 4,3 5,4 0.056,5 8.438,6 33.579,7 6.682}
{0 CHEMBL1927157,1 4,2 4,3 5,4 0.056,5 8.438,6 33.579,7 6.947}
{0 CHEMBL1927158,1 4,2 5.6,3 6,4 0.069,5 7.732,6 34.993,7 6.664}
{0 CHEMBL1927159,1 4,2 6.8,3 7,4 0.079,5 7.569,6 37.74,7 6.674}
{0 CHEMBL1927160,1 4,2 8.8,3 3,4 0.027,5 9.346,6 23.67,7 6.762}
{0 CHEMBL223225,1 2,2 4.9,4 0.091,5 8.327,6 28.655,7 4.77}
{0 CHEMBL224501,4 0.071,5 10.828,6 28.047,7 4.77}
{0 CHEMBL224702,2 2.3,3 1,4 0.087,5 7.591,6 28.972,7 4.77}
{0 CHEMBL224741,4 0.071,5 8.061,6 27.114,7 4.77}
{0 CHEMBL224913,1 2,2 4.9,4 0.091,5 8.327,6 28.655,7 4.77}
{0 CHEMBL225083,3 2,4 0.08,5 7.223,6 30.805,7 5.1}
{0 CHEMBL225270,3 1,4 0.059,5 7.322,6 21.204,7 4.77}
{0 CHEMBL278262,1 2,2 4.9,4 0.091,5 8.327,6 28.655,7 4.77}
{0 CHEMBL284153,2 2.8,4 0.077,5 7.954,6 24.918,7 4.77}
{0 CHEMBL34173,4 0.071,5 7.6,6 26.73,7 4.77}
{0 CHEMBL355832,1 1,2 2.9,4 0.083,5 8.688,6 23.6,7 4.77}
{0 CHEMBL358678,1 1,4 0.107,5 12.371,6 20.987,7 4.77}
{0 CHEMBL376139,4 0.071,5 8.483,6 27.558,7 4.77}
{0 CHEMBL389656,2 2.5,4 0.07,5 7.81,6 27.445,7 4.77}
{0 CHEMBL390388,2 2.5,4 0.07,5 7.81,6 27.445,7 4.77}
{0 CHEMBL390793,2 2.3,3 1,4 0.087,5 7.591,6 28.972,7 4.77}
{0 CHEMBL407734,1 1,2 3.6,3 1,4 0.033,5 8.619,6 19.557,7 6.807}
{0 CHEMBL413785,3 1,4 0.067,5 7.391,6 28.257,7 4.77}
{0 CHEMBL422,3 9,4 0.073,5 7.837,6 32.723,7 4.77}
{0 CHEMBL427244,4 0.071,5 8.483,6 27.558,7 4.77}
{0 CHEMBL434759,3 1,4 0.067,5 7.391,6 28.257,7 4.77}
{0 CHEMBL441558,2 4.5,3 1,4 0.085,5 7.782,6 29.687,7 5.742}
{0 CHEMBL541018,3 1,5 10.28,6 18.992,7 6}
{0 CHEMBL567,2 1.9,3 9,4 0.107,5 7.623,6 33.115,7 4.77}
{0 CHEMBL587104,2 6.3,3 2,4 0.098,5 7.759,6 31.928,7 6.167}
{0 CHEMBL64404,2 3.7,3 1,4 0.034,5 8.493,6 18.557,7 6.04}
{0 CHEMBL71,3 5,4 0.095,5 7.972,6 25.799,7 4.77}
{0 CHEMBL726,2 1.8,3 10,4 0.102,5 7.814,6 34.964,7 4.77}
{0 CHEMBL828,5 8.665,6 16.316,7 6.445}
