"molecule_id","AMW","C.","pXC50"
{1 8.138,2 46.2,3 6.676}
{0 CHEMBL2024685,1 8.235,2 47.5,3 7.357}
{0 CHEMBL2024686,1 7.891,2 45.2,3 6.87}
{0 CHEMBL2024687,1 7.891,2 45.2,3 6.158}
{0 CHEMBL2024688,1 8.138,2 46.2,3 7.215}
{0 CHEMBL2024689,1 7.676,2 44.4,3 6.562}
{0 CHEMBL2024690,1 8.426,2 47.2,3 7.137}
{0 CHEMBL2024691,1 7.891,2 45.2,3 7.328}
{0 CHEMBL2024692,1 7.891,2 45.2,3 6.15}
{0 CHEMBL2024693,1 7.987,2 46.5,3 7.337}
