{
  "data_features": {
    "feature": [
      {
        "data_type": "nominal",
        "index": "0",
        "is_ignore": "false",
        "is_row_identifier": "true",
        "is_target": "false",
        "name": "molecule_id",
        "nominal_value": [
          "CHEMBL1088240",
          "CHEMBL1089082",
          "CHEMBL1765781",
          "CHEMBL1808569",
          "CHEMBL1808570",
          "CHEMBL1808571",
          "CHEMBL1808572",
          "CHEMBL1808573",
          "CHEMBL1808574",
          "CHEMBL1808575",
          "CHEMBL1808576",
          "CHEMBL1808577",
          "CHEMBL1808578",
          "CHEMBL1808579",
          "CHEMBL1808580",
          "CHEMBL1808581",
          "CHEMBL1808582",
          "CHEMBL1808583",
          "CHEMBL1808584",
          "CHEMBL1808585",
          "CHEMBL1808586",
          "CHEMBL1808587",
          "CHEMBL1808588",
          "CHEMBL1808589",
          "CHEMBL1808590",
          "CHEMBL1808591",
          "CHEMBL1808592",
          "CHEMBL1808593",
          "CHEMBL1808594",
          "CHEMBL1808595",
          "CHEMBL1808596",
          "CHEMBL1834657",
          "CHEMBL1836636",
          "CHEMBL1836637",
          "CHEMBL1836638",
          "CHEMBL1836639",
          "CHEMBL1836640",
          "CHEMBL1836641",
          "CHEMBL1836642",
          "CHEMBL1836643",
          "CHEMBL1836712",
          "CHEMBL1836713",
          "CHEMBL1836714",
          "CHEMBL1836715",
          "CHEMBL1836716",
          "CHEMBL1836717",
          "CHEMBL1836718",
          "CHEMBL1836719",
          "CHEMBL1836720",
          "CHEMBL1836721",
          "CHEMBL1836722",
          "CHEMBL1836723",
          "CHEMBL1836724",
          "CHEMBL1836725",
          "CHEMBL1836726",
          "CHEMBL1836727",
          "CHEMBL1836728",
          "CHEMBL1836729",
          "CHEMBL1945559",
          "CHEMBL1957190",
          "CHEMBL196771",
          "CHEMBL196918",
          "CHEMBL196919",
          "CHEMBL196959",
          "CHEMBL197006",
          "CHEMBL197164",
          "CHEMBL197382",
          "CHEMBL197538",
          "CHEMBL197603",
          "CHEMBL197923",
          "CHEMBL198022",
          "CHEMBL198577",
          "CHEMBL198581",
          "CHEMBL198647",
          "CHEMBL198739",
          "CHEMBL198904",
          "CHEMBL198905",
          "CHEMBL199000",
          "CHEMBL199210",
          "CHEMBL199230",
          "CHEMBL199383",
          "CHEMBL199528",
          "CHEMBL199755",
          "CHEMBL199951",
          "CHEMBL200247",
          "CHEMBL200381",
          "CHEMBL200499",
          "CHEMBL200657",
          "CHEMBL219628",
          "CHEMBL219682",
          "CHEMBL220037",
          "CHEMBL220233",
          "CHEMBL220685",
          "CHEMBL221005",
          "CHEMBL221006",
          "CHEMBL221221",
          "CHEMBL221269",
          "CHEMBL221274",
          "CHEMBL221330",
          "CHEMBL222202",
          "CHEMBL222467",
          "CHEMBL222468",
          "CHEMBL222666",
          "CHEMBL222829",
          "CHEMBL222882",
          "CHEMBL222954",
          "CHEMBL223011",
          "CHEMBL223088",
          "CHEMBL223587",
          "CHEMBL223877",
          "CHEMBL230116",
          "CHEMBL230117",
          "CHEMBL230230",
          "CHEMBL230232",
          "CHEMBL230553",
          "CHEMBL230554",
          "CHEMBL230654",
          "CHEMBL230655",
          "CHEMBL230656",
          "CHEMBL230755",
          "CHEMBL230761",
          "CHEMBL230762",
          "CHEMBL230763",
          "CHEMBL230870",
          "CHEMBL230871",
          "CHEMBL2333163",
          "CHEMBL241988",
          "CHEMBL241989",
          "CHEMBL241990",
          "CHEMBL242206",
          "CHEMBL242207",
          "CHEMBL242208",
          "CHEMBL242237",
          "CHEMBL242425",
          "CHEMBL242426",
          "CHEMBL242427",
          "CHEMBL242636",
          "CHEMBL242637",
          "CHEMBL242638",
          "CHEMBL242852",
          "CHEMBL242854",
          "CHEMBL245212",
          "CHEMBL261238",
          "CHEMBL263802",
          "CHEMBL271190",
          "CHEMBL360190",
          "CHEMBL370336",
          "CHEMBL370655",
          "CHEMBL371095",
          "CHEMBL371239",
          "CHEMBL371242",
          "CHEMBL371532",
          "CHEMBL371658",
          "CHEMBL373001",
          "CHEMBL373480",
          "CHEMBL373557",
          "CHEMBL374071",
          "CHEMBL374210",
          "CHEMBL374241",
          "CHEMBL374258",
          "CHEMBL374482",
          "CHEMBL374785",
          "CHEMBL374852",
          "CHEMBL375813",
          "CHEMBL376288",
          "CHEMBL376501",
          "CHEMBL389542",
          "CHEMBL391305",
          "CHEMBL395063",
          "CHEMBL395573",
          "CHEMBL395575",
          "CHEMBL395997",
          "CHEMBL397949",
          "CHEMBL397950",
          "CHEMBL397986",
          "CHEMBL404939",
          "CHEMBL410643",
          "CHEMBL425213",
          "CHEMBL425834",
          "CHEMBL426886",
          "CHEMBL426924",
          "CHEMBL428714",
          "CHEMBL436817",
          "CHEMBL445178",
          "CHEMBL447512",
          "CHEMBL450984",
          "CHEMBL476228",
          "CHEMBL476229",
          "CHEMBL476230",
          "CHEMBL476442",
          "CHEMBL482863",
          "CHEMBL482864",
          "CHEMBL483484",
          "CHEMBL483685",
          "CHEMBL488646",
          "CHEMBL488811",
          "CHEMBL489058",
          "CHEMBL489812",
          "CHEMBL490423",
          "CHEMBL491029",
          "CHEMBL491228",
          "CHEMBL491434",
          "CHEMBL491435",
          "CHEMBL491635",
          "CHEMBL492251",
          "CHEMBL494221",
          "CHEMBL495584",
          "CHEMBL495585",
          "CHEMBL495617",
          "CHEMBL495866",
          "CHEMBL495867",
          "CHEMBL496388",
          "CHEMBL496536",
          "CHEMBL496543",
          "CHEMBL496590",
          "CHEMBL496591",
          "CHEMBL496594",
          "CHEMBL496595",
          "CHEMBL496752",
          "CHEMBL496947",
          "CHEMBL497151",
          "CHEMBL497228",
          "CHEMBL497367",
          "CHEMBL497791",
          "CHEMBL497792",
          "CHEMBL497883",
          "CHEMBL498028",
          "CHEMBL498029",
          "CHEMBL498070",
          "CHEMBL498071",
          "CHEMBL498072",
          "CHEMBL498222",
          "CHEMBL498385",
          "CHEMBL498592",
          "CHEMBL498593",
          "CHEMBL498599",
          "CHEMBL499853",
          "CHEMBL501709",
          "CHEMBL504547",
          "CHEMBL505637",
          "CHEMBL505892",
          "CHEMBL507453",
          "CHEMBL510730",
          "CHEMBL514360",
          "CHEMBL518731",
          "CHEMBL522129",
          "CHEMBL522217",
          "CHEMBL523059",
          "CHEMBL523921",
          "CHEMBL524069",
          "CHEMBL524274",
          "CHEMBL524468",
          "CHEMBL524638",
          "CHEMBL526374",
          "CHEMBL526487",
          "CHEMBL526840",
          "CHEMBL527026",
          "CHEMBL529663",
          "CHEMBL539169",
          "CHEMBL565061",
          "CHEMBL583042",
          "CHEMBL590109",
          "CHEMBL597592",
          "CHEMBL598626",
          "CHEMBL602123",
          "CHEMBL6246"
        ],
        "number_of_missing_values": "0"
      },
      {
        "data_type": "numeric",
        "index": "1",
        "is_ignore": "false",
        "is_row_identifier": "false",
        "is_target": "false",
        "name": "FCFP4_1024b1005",
        "number_of_missing_values": "0"
      },
      {
        "data_type": "numeric",
        "index": "2",
        "is_ignore": "false",
        "is_row_identifier": "false",
        "is_target": "false",
        "name": "FCFP4_1024b100",
        "number_of_missing_values": "0"
      },
      {
        "data_type": "numeric",
        "index": "3",
        "is_ignore": "false",
        "is_row_identifier": "false",
        "is_target": "false",
        "name": "FCFP4_1024b48",
        "number_of_missing_values": "0"
      },
      {
        "data_type": "numeric",
        "index": "4",
        "is_ignore": "false",
        "is_row_identifier": "false",
        "is_target": "false",
        "name": "FCFP4_1024b283",
        "number_of_missing_values": "0"
      },
      {
        "data_type": "numeric",
        "index": "5",
        "is_ignore": "false",
        "is_row_identifier": "false",
        "is_target": "false",
        "name": "FCFP4_1024b63",
        "number_of_missing_values": "0"
      },
      {
        "data_type": "numeric",
        "index": "6",
        "is_ignore": "false",
        "is_row_identifier": "false",
        "is_target": "false",
        "name": "FCFP4_1024b203",
        "number_of_missing_values": "0"
      },
      {
        "data_type": "numeric",
        "index": "7",
        "is_ignore": "false",
        "is_row_identifier": "false",
        "is_target": "false",
        "name": "FCFP4_1024b239",
        "number_of_missing_values": "0"
      },
      {
        "data_type": "numeric",
        "index": "8",
        "is_ignore": "false",
        "is_row_identifier": "false",
        "is_target": "false",
        "name": "FCFP4_1024b341",
        "number_of_missing_values": "0"
      },
      {
        "data_type": "numeric",
        "index": "9",
        "is_ignore": "false",
        "is_row_identifier": "false",
        "is_target": "false",
        "name": "FCFP4_1024b647",
        "number_of_missing_values": "0"
      },
      {
        "data_type": "numeric",
        "index": "10",
        "is_ignore": "false",
        "is_row_identifier": "false",
        "is_target": "false",
        "name": "FCFP4_1024b711",
        "number_of_missing_values": "0"
      },
      {
        "data_type": "numeric",
        "index": "11",
        "is_ignore": "false",
        "is_row_identifier": "false",
        "is_target": "false",
        "name": "FCFP4_1024b38",
        "number_of_missing_values": "0"
      },
      {
        "data_type": "numeric",
        "index": "12",
        "is_ignore": "false",
        "is_row_identifier": "false",
        "is_target": "false",
        "name": "FCFP4_1024b635",
        "number_of_missing_values": "0"
      },
      {
        "data_type": "numeric",
        "index": "13",
        "is_ignore": "false",
        "is_row_identifier": "false",
        "is_target": "false",
        "name": "FCFP4_1024b207",
        "number_of_missing_values": "0"
      },
      {
        "data_type": "numeric",
        "index": "14",
        "is_ignore": "false",
        "is_row_identifier": "false",
        "is_target": "false",
        "name": "FCFP4_1024b530",
        "number_of_missing_values": "0"
      },
      {
        "data_type": "numeric",
        "index": "15",
        "is_ignore": "false",
        "is_row_identifier": "false",
        "is_target": "false",
        "name": "FCFP4_1024b899",
        "number_of_missing_values": "0"
      },
      {
        "data_type": "numeric",
        "index": "16",
        "is_ignore": "false",
        "is_row_identifier": "false",
        "is_target": "false",
        "name": "FCFP4_1024b858",
        "number_of_missing_values": "0"
      },
      {
        "data_type": "numeric",
        "index": "17",
        "is_ignore": "false",
        "is_row_identifier": "false",
        "is_target": "false",
        "name": "FCFP4_1024b993",
        "number_of_missing_values": "0"
      },
      {
        "data_type": "numeric",
        "index": "18",
        "is_ignore": "false",
        "is_row_identifier": "false",
        "is_target": "false",
        "name": "FCFP4_1024b495",
        "number_of_missing_values": "0"
      },
      {
        "data_type": "numeric",
        "index": "19",
        "is_ignore": "false",
        "is_row_identifier": "false",
        "is_target": "false",
        "name": "FCFP4_1024b327",
        "number_of_missing_values": "0"
      },
      {
        "data_type": "numeric",
        "index": "20",
        "is_ignore": "false",
        "is_row_identifier": "false",
        "is_target": "false",
        "name": "FCFP4_1024b363",
        "number_of_missing_values": "0"
      },
      {
        "data_type": "numeric",
        "index": "21",
        "is_ignore": "false",
        "is_row_identifier": "false",
        "is_target": "false",
        "name": "FCFP4_1024b453",
        "number_of_missing_values": "0"
      },
      {
        "data_type": "numeric",
        "index": "22",
        "is_ignore": "false",
        "is_row_identifier": "false",
        "is_target": "false",
        "name": "FCFP4_1024b826",
        "number_of_missing_values": "0"
      },
      {
        "data_type": "numeric",
        "index": "23",
        "is_ignore": "false",
        "is_row_identifier": "false",
        "is_target": "false",
        "name": "FCFP4_1024b281",
        "number_of_missing_values": "0"
      },
      {
        "data_type": "numeric",
        "index": "24",
        "is_ignore": "false",
        "is_row_identifier": "false",
        "is_target": "false",
        "name": "FCFP4_1024b937",
        "number_of_missing_values": "0"
      },
      {
        "data_type": "numeric",
        "index": "25",
        "is_ignore": "false",
        "is_row_identifier": "false",
        "is_target": "false",
        "name": "FCFP4_1024b472",
        "number_of_missing_values": "0"
      },
      {
        "data_type": "numeric",
        "index": "26",
        "is_ignore": "false",
        "is_row_identifier": "false",
        "is_target": "false",
        "name": "FCFP4_1024b710",
        "number_of_missing_values": "0"
      },
      {
        "data_type": "numeric",
        "index": "27",
        "is_ignore": "false",
        "is_row_identifier": "false",
        "is_target": "false",
        "name": "FCFP4_1024b137",
        "number_of_missing_values": "0"
      },
      {
        "data_type": "numeric",
        "index": "28",
        "is_ignore": "false",
        "is_row_identifier": "false",
        "is_target": "false",
        "name": "FCFP4_1024b301",
        "number_of_missing_values": "0"
      },
      {
        "data_type": "numeric",
        "index": "29",
        "is_ignore": "false",
        "is_row_identifier": "false",
        "is_target": "false",
        "name": "FCFP4_1024b107",
        "number_of_missing_values": "0"
      },
      {
        "data_type": "numeric",
        "index": "30",
        "is_ignore": "false",
        "is_row_identifier": "false",
        "is_target": "false",
        "name": "FCFP4_1024b971",
        "number_of_missing_values": "0"
      },
      {
        "data_type": "numeric",
        "index": "31",
        "is_ignore": "false",
        "is_row_identifier": "false",
        "is_target": "false",
        "name": "FCFP4_1024b461",
        "number_of_missing_values": "0"
      },
      {
        "data_type": "numeric",
        "index": "32",
        "is_ignore": "false",
        "is_row_identifier": "false",
        "is_target": "false",
        "name": "FCFP4_1024b10",
        "number_of_missing_values": "0"
      },
      {
        "data_type": "numeric",
        "index": "33",
        "is_ignore": "false",
        "is_row_identifier": "false",
        "is_target": "false",
        "name": "FCFP4_1024b632",
        "number_of_missing_values": "0"
      },
      {
        "data_type": "numeric",
        "index": "34",
        "is_ignore": "false",
        "is_row_identifier": "false",
        "is_target": "false",
        "name": "FCFP4_1024b252",
        "number_of_missing_values": "0"
      },
      {
        "data_type": "numeric",
        "index": "35",
        "is_ignore": "false",
        "is_row_identifier": "false",
        "is_target": "false",
        "name": "FCFP4_1024b2",
        "number_of_missing_values": "0"
      },
      {
        "data_type": "numeric",
        "index": "36",
        "is_ignore": "false",
        "is_row_identifier": "false",
        "is_target": "false",
        "name": "FCFP4_1024b139",
        "number_of_missing_values": "0"
      },
      {
        "data_type": "numeric",
        "index": "37",
        "is_ignore": "false",
        "is_row_identifier": "false",
        "is_target": "false",
        "name": "FCFP4_1024b298",
        "number_of_missing_values": "0"
      },
      {
        "data_type": "numeric",
        "index": "38",
        "is_ignore": "false",
        "is_row_identifier": "false",
        "is_target": "false",
        "name": "FCFP4_1024b409",
        "number_of_missing_values": "0"
      },
      {
        "data_type": "numeric",
        "index": "39",
        "is_ignore": "false",
        "is_row_identifier": "false",
        "is_target": "false",
        "name": "FCFP4_1024b111",
        "number_of_missing_values": "0"
      },
      {
        "data_type": "numeric",
        "index": "40",
        "is_ignore": "false",
        "is_row_identifier": "false",
        "is_target": "false",
        "name": "FCFP4_1024b270",
        "number_of_missing_values": "0"
      },
      {
        "data_type": "numeric",
        "index": "41",
        "is_ignore": "false",
        "is_row_identifier": "false",
        "is_target": "false",
        "name": "FCFP4_1024b760",
        "number_of_missing_values": "0"
      },
      {
        "data_type": "numeric",
        "index": "42",
        "is_ignore": "false",
        "is_row_identifier": "false",
        "is_target": "false",
        "name": "FCFP4_1024b330",
        "number_of_missing_values": "0"
      },
      {
        "data_type": "numeric",
        "index": "43",
        "is_ignore": "false",
        "is_row_identifier": "false",
        "is_target": "false",
        "name": "FCFP4_1024b983",
        "number_of_missing_values": "0"
      },
      {
        "data_type": "numeric",
        "index": "44",
        "is_ignore": "false",
        "is_row_identifier": "false",
        "is_target": "false",
        "name": "FCFP4_1024b1",
        "number_of_missing_values": "0"
      },
      {
        "data_type": "numeric",
        "index": "45",
        "is_ignore": "false",
        "is_row_identifier": "false",
        "is_target": "false",
        "name": "FCFP4_1024b1000",
        "number_of_missing_values": "0"
      },
      {
        "data_type": "numeric",
        "index": "46",
        "is_ignore": "false",
        "is_row_identifier": "false",
        "is_target": "false",
        "name": "FCFP4_1024b1001",
        "number_of_missing_values": "0"
      },
      {
        "data_type": "numeric",
        "index": "47",
        "is_ignore": "false",
        "is_row_identifier": "false",
        "is_target": "false",
        "name": "FCFP4_1024b1002",
        "number_of_missing_values": "0"
      },
      {
        "data_type": "numeric",
        "index": "48",
        "is_ignore": "false",
        "is_row_identifier": "false",
        "is_target": "false",
        "name": "FCFP4_1024b1003",
        "number_of_missing_values": "0"
      },
      {
        "data_type": "numeric",
        "index": "49",
        "is_ignore": "false",
        "is_row_identifier": "false",
        "is_target": "false",
        "name": "FCFP4_1024b1004",
        "number_of_missing_values": "0"
      },
      {
        "data_type": "numeric",
        "index": "50",
        "is_ignore": "false",
        "is_row_identifier": "false",
        "is_target": "false",
        "name": "FCFP4_1024b1006",
        "number_of_missing_values": "0"
      },
      {
        "data_type": "numeric",
        "index": "51",
        "is_ignore": "false",
        "is_row_identifier": "false",
        "is_target": "false",
        "name": "FCFP4_1024b1007",
        "number_of_missing_values": "0"
      },
      {
        "data_type": "numeric",
        "index": "52",
        "is_ignore": "false",
        "is_row_identifier": "false",
        "is_target": "true",
        "name": "pXC50",
        "number_of_missing_values": "0"
      }
    ]
  }
}