{
  "data_set_description": {
    "collection_date": "November 2013",
    "creator": "Dr Jeremy Besnard, Dr Ivan Olier, Dr Noureddin Sadawi, Dr Larisa Soldatova, Dr Crina Grosan, Prof Ross King, Dr Richard Bickerton, Prof Andrew Hopkins and Dr Willem van Hoorn",
    "default_target_attribute": "pXC50",
    "description": "This dataset contains QSAR data (from ChEMBL version 17) showing activity values (unit is pseudo-pCI50) of several compounds on drug target ChEMBL_ID: CHEMBL1741171 (TID: 103967), and it has 1875 rows and 1426 features (not including molecule IDs and class feature: molecule_id and pXC50). The features represent Molecular Descriptors which were generated from SMILES strings. Missing value imputation was applied to this dataset (By choosing the Median).",
    "description_version": "1",
    "file_id": "3417827",
    "format": "ARFF",
    "id": "30361",
    "licence": "Public",
    "md5_checksum": "fec09a3c2dd7fa4d6528090996932922",
    "minio_url": "https://data.openml.org/datasets/0003/30361/dataset_30361.pq",
    "name": "QSAR-DATASET-FOR-DRUG-TARGET-CHEMBL1741171",
    "original_data_url": "https://www.ebi.ac.uk/chembl/target/inspect/CHEMBL1741171",
    "parquet_url": "https://data.openml.org/datasets/0003/30361/dataset_30361.pq",
    "processing_date": "2018-10-04 01:48:43",
    "row_id_attribute": "molecule_id",
    "status": "deactivated",
    "tag": [
      "MetaQSAR",
      "study_13"
    ],
    "upload_date": "2016-07-15T04:48:47",
    "url": "https://api.openml.org/data/v1/download/3417827/QSAR-DATASET-FOR-DRUG-TARGET-CHEMBL1741171.arff",
    "version": "6",
    "visibility": "public"
  }
}