"molecule_id","FCFP4_1024b1","FCFP4_1024b10","FCFP4_1024b100","FCFP4_1024b1000","FCFP4_1024b1001","FCFP4_1024b1002","FCFP4_1024b1003","FCFP4_1024b1004","FCFP4_1024b1005","FCFP4_1024b1006","FCFP4_1024b1007","FCFP4_1024b1008","FCFP4_1024b1009","FCFP4_1024b101","FCFP4_1024b1010","FCFP4_1024b1011","FCFP4_1024b1012","FCFP4_1024b1013","FCFP4_1024b1014","FCFP4_1024b1015","FCFP4_1024b1016","FCFP4_1024b1017","FCFP4_1024b1018","FCFP4_1024b1019","FCFP4_1024b102","FCFP4_1024b1020","FCFP4_1024b1021","FCFP4_1024b1022","FCFP4_1024b1023","FCFP4_1024b1024","FCFP4_1024b103","FCFP4_1024b104","FCFP4_1024b105","FCFP4_1024b106","FCFP4_1024b107","FCFP4_1024b108","FCFP4_1024b109","FCFP4_1024b11","FCFP4_1024b110","FCFP4_1024b111","FCFP4_1024b112","FCFP4_1024b113","FCFP4_1024b114","FCFP4_1024b115","FCFP4_1024b116","FCFP4_1024b117","FCFP4_1024b118","FCFP4_1024b119","FCFP4_1024b12","FCFP4_1024b120","FCFP4_1024b121","pXC50"
{1 1,5 1,24 1,52 6}
{0 CHEMBL312837,1 1,5 1,24 1,52 6}
{0 CHEMBL313428,1 1,2 1,24 1,52 6.721}
{0 CHEMBL315944,1 1,5 1,24 1,52 6}
{0 CHEMBL316184,1 1,52 8.398}
{0 CHEMBL431007,1 1,24 1,52 6}
{0 CHEMBL521,1 1,52 6.658}
{0 CHEMBL6,1 1,23 1,52 7.699}
{0 CHEMBL82292,1 1,24 1,52 6.276}
{0 CHEMBL82325,1 1,24 1,52 6.678}
{0 CHEMBL83990,1 1,2 1,24 1,52 7.097}
{0 CHEMBL84599,1 1,2 1,7 1,24 1,52 6.337}
{0 CHEMBL84670,1 1,2 1,24 1,52 6.62}
{0 CHEMBL84750,1 1,52 4.357}
{0 CHEMBL84785,1 1,2 1,24 1,52 6.921}
{0 CHEMBL85455,1 1,24 1,52 6.125}
{0 CHEMBL85776,1 1,52 6.959}
