{
  "data_set_description": {
    "collection_date": "November 2013",
    "creator": "Dr Jeremy Besnard, Dr Ivan Olier, Dr Noureddin Sadawi, Dr Larisa Soldatova, Dr Crina Grosan, Prof Ross King, Dr Richard Bickerton, Prof Andrew Hopkins and Dr Willem van Hoorn",
    "default_target_attribute": "pXC50",
    "description": "This dataset contains QSAR data (from ChEMBL version 17) showing activity values (unit is pseudo-pCI50) of several compounds on drug target ChEMBL_ID: CHEMBL2231 (TID: 11113), and it has 94 rows and 1226 features (not including molecule IDs and class feature: molecule_id and pXC50). The features represent Molecular Descriptors which were generated from SMILES strings. Missing value imputation was applied to this dataset (By choosing the Median).",
    "description_version": "1",
    "file_id": "3415962",
    "format": "ARFF",
    "id": "30290",
    "licence": "Public",
    "md5_checksum": "20767079c5acaea0eaf5b42fed0e47ca",
    "minio_url": "https://data.openml.org/datasets/0003/30290/dataset_30290.pq",
    "name": "QSAR-DATASET-FOR-DRUG-TARGET-CHEMBL2231",
    "original_data_url": "https://www.ebi.ac.uk/chembl/target/inspect/CHEMBL2231",
    "parquet_url": "https://data.openml.org/datasets/0003/30290/dataset_30290.pq",
    "processing_date": "2018-10-04 01:45:50",
    "row_id_attribute": "molecule_id",
    "status": "deactivated",
    "tag": [
      "MetaQSAR",
      "study_13"
    ],
    "upload_date": "2016-07-15T04:38:08",
    "url": "https://api.openml.org/data/v1/download/3415962/QSAR-DATASET-FOR-DRUG-TARGET-CHEMBL2231.arff",
    "version": "7",
    "visibility": "public"
  }
}