{
  "data_features": {
    "feature": [
      {
        "data_type": "nominal",
        "index": "0",
        "is_ignore": "false",
        "is_row_identifier": "true",
        "is_target": "false",
        "name": "molecule_id",
        "nominal_value": [
          "CHEMBL104157",
          "CHEMBL104192",
          "CHEMBL104241",
          "CHEMBL104426",
          "CHEMBL104815",
          "CHEMBL104872",
          "CHEMBL104930",
          "CHEMBL104970",
          "CHEMBL105439",
          "CHEMBL105569",
          "CHEMBL105875",
          "CHEMBL105935",
          "CHEMBL106035",
          "CHEMBL106079",
          "CHEMBL106111",
          "CHEMBL106395",
          "CHEMBL106412",
          "CHEMBL106718",
          "CHEMBL106869",
          "CHEMBL107132",
          "CHEMBL107140",
          "CHEMBL107188",
          "CHEMBL107203",
          "CHEMBL107210",
          "CHEMBL107256",
          "CHEMBL107282",
          "CHEMBL107392",
          "CHEMBL107429",
          "CHEMBL107522",
          "CHEMBL107592",
          "CHEMBL107627",
          "CHEMBL107743",
          "CHEMBL107911",
          "CHEMBL108058",
          "CHEMBL108354",
          "CHEMBL108468",
          "CHEMBL109999",
          "CHEMBL110419",
          "CHEMBL110628",
          "CHEMBL110753",
          "CHEMBL110903",
          "CHEMBL111013",
          "CHEMBL111122",
          "CHEMBL11391",
          "CHEMBL116378",
          "CHEMBL117156",
          "CHEMBL118156",
          "CHEMBL118304",
          "CHEMBL118334",
          "CHEMBL118361",
          "CHEMBL118392",
          "CHEMBL118799",
          "CHEMBL118836",
          "CHEMBL118906",
          "CHEMBL118989",
          "CHEMBL119249",
          "CHEMBL119456",
          "CHEMBL119773",
          "CHEMBL119881",
          "CHEMBL119913",
          "CHEMBL119964",
          "CHEMBL119966",
          "CHEMBL120341",
          "CHEMBL120384",
          "CHEMBL120387",
          "CHEMBL120413",
          "CHEMBL120629",
          "CHEMBL120749",
          "CHEMBL120765",
          "CHEMBL121032",
          "CHEMBL121575",
          "CHEMBL133027",
          "CHEMBL135041",
          "CHEMBL135198",
          "CHEMBL135815",
          "CHEMBL135998",
          "CHEMBL137311",
          "CHEMBL137780",
          "CHEMBL138441",
          "CHEMBL140545",
          "CHEMBL141043",
          "CHEMBL141424",
          "CHEMBL141676",
          "CHEMBL19365",
          "CHEMBL20936",
          "CHEMBL262805",
          "CHEMBL263924",
          "CHEMBL317199",
          "CHEMBL317271",
          "CHEMBL318175",
          "CHEMBL318177",
          "CHEMBL318304",
          "CHEMBL318352",
          "CHEMBL318773",
          "CHEMBL319035",
          "CHEMBL319227",
          "CHEMBL319396",
          "CHEMBL319868",
          "CHEMBL320257",
          "CHEMBL320285",
          "CHEMBL320393",
          "CHEMBL320512",
          "CHEMBL320937",
          "CHEMBL321162",
          "CHEMBL322165",
          "CHEMBL322404",
          "CHEMBL322437",
          "CHEMBL322542",
          "CHEMBL322622",
          "CHEMBL322830",
          "CHEMBL322901",
          "CHEMBL323101",
          "CHEMBL323304",
          "CHEMBL323452",
          "CHEMBL324188",
          "CHEMBL324337",
          "CHEMBL324569",
          "CHEMBL324673",
          "CHEMBL324793",
          "CHEMBL325166",
          "CHEMBL325529",
          "CHEMBL326013",
          "CHEMBL326046",
          "CHEMBL326316",
          "CHEMBL326704",
          "CHEMBL326866",
          "CHEMBL326959",
          "CHEMBL327600",
          "CHEMBL330960",
          "CHEMBL331561",
          "CHEMBL331648",
          "CHEMBL331666",
          "CHEMBL331686",
          "CHEMBL331896",
          "CHEMBL331939",
          "CHEMBL331943",
          "CHEMBL331955",
          "CHEMBL332121",
          "CHEMBL332160",
          "CHEMBL332256",
          "CHEMBL332619",
          "CHEMBL332650",
          "CHEMBL333548",
          "CHEMBL333639",
          "CHEMBL333678",
          "CHEMBL333891",
          "CHEMBL333958",
          "CHEMBL334454",
          "CHEMBL336844",
          "CHEMBL340336",
          "CHEMBL341933",
          "CHEMBL342604",
          "CHEMBL342838",
          "CHEMBL342914",
          "CHEMBL344204",
          "CHEMBL38512",
          "CHEMBL409260",
          "CHEMBL411506",
          "CHEMBL419049",
          "CHEMBL419227",
          "CHEMBL420476",
          "CHEMBL420546",
          "CHEMBL421411",
          "CHEMBL421760",
          "CHEMBL423699",
          "CHEMBL431666",
          "CHEMBL433644",
          "CHEMBL434219",
          "CHEMBL436563",
          "CHEMBL448420",
          "CHEMBL450936",
          "CHEMBL51173",
          "CHEMBL93681",
          "CHEMBL93796",
          "CHEMBL93854",
          "CHEMBL97597"
        ],
        "number_of_missing_values": "0"
      },
      {
        "data_type": "numeric",
        "index": "1",
        "is_ignore": "false",
        "is_row_identifier": "false",
        "is_target": "false",
        "name": "CATS2D_06_AP",
        "number_of_missing_values": "0"
      },
      {
        "data_type": "numeric",
        "index": "2",
        "is_ignore": "false",
        "is_row_identifier": "false",
        "is_target": "false",
        "name": "CATS2D_09_DP",
        "number_of_missing_values": "0"
      },
      {
        "data_type": "numeric",
        "index": "3",
        "is_ignore": "false",
        "is_row_identifier": "false",
        "is_target": "false",
        "name": "CATS2D_08_PL",
        "number_of_missing_values": "0"
      },
      {
        "data_type": "numeric",
        "index": "4",
        "is_ignore": "false",
        "is_row_identifier": "false",
        "is_target": "false",
        "name": "CATS2D_09_DD",
        "number_of_missing_values": "0"
      },
      {
        "data_type": "numeric",
        "index": "5",
        "is_ignore": "false",
        "is_row_identifier": "false",
        "is_target": "false",
        "name": "H.053",
        "number_of_missing_values": "0"
      },
      {
        "data_type": "numeric",
        "index": "6",
        "is_ignore": "false",
        "is_row_identifier": "false",
        "is_target": "false",
        "name": "H.052",
        "number_of_missing_values": "0"
      },
      {
        "data_type": "numeric",
        "index": "7",
        "is_ignore": "false",
        "is_row_identifier": "false",
        "is_target": "false",
        "name": "GATS8i",
        "number_of_missing_values": "0"
      },
      {
        "data_type": "numeric",
        "index": "8",
        "is_ignore": "false",
        "is_row_identifier": "false",
        "is_target": "false",
        "name": "CATS2D_05_DL",
        "number_of_missing_values": "0"
      },
      {
        "data_type": "numeric",
        "index": "9",
        "is_ignore": "false",
        "is_row_identifier": "false",
        "is_target": "false",
        "name": "MATS8i",
        "number_of_missing_values": "0"
      },
      {
        "data_type": "numeric",
        "index": "10",
        "is_ignore": "false",
        "is_row_identifier": "false",
        "is_target": "false",
        "name": "nH",
        "number_of_missing_values": "0"
      },
      {
        "data_type": "numeric",
        "index": "11",
        "is_ignore": "false",
        "is_row_identifier": "false",
        "is_target": "false",
        "name": "CATS2D_07_DD",
        "number_of_missing_values": "0"
      },
      {
        "data_type": "numeric",
        "index": "12",
        "is_ignore": "false",
        "is_row_identifier": "false",
        "is_target": "false",
        "name": "Eta_C_A",
        "number_of_missing_values": "0"
      },
      {
        "data_type": "numeric",
        "index": "13",
        "is_ignore": "false",
        "is_row_identifier": "false",
        "is_target": "false",
        "name": "ATSC1v",
        "number_of_missing_values": "0"
      },
      {
        "data_type": "numeric",
        "index": "14",
        "is_ignore": "false",
        "is_row_identifier": "false",
        "is_target": "false",
        "name": "SRW07",
        "number_of_missing_values": "0"
      },
      {
        "data_type": "numeric",
        "index": "15",
        "is_ignore": "false",
        "is_row_identifier": "false",
        "is_target": "false",
        "name": "SRW09",
        "number_of_missing_values": "0"
      },
      {
        "data_type": "numeric",
        "index": "16",
        "is_ignore": "false",
        "is_row_identifier": "false",
        "is_target": "false",
        "name": "ATSC8s",
        "number_of_missing_values": "0"
      },
      {
        "data_type": "numeric",
        "index": "17",
        "is_ignore": "false",
        "is_row_identifier": "false",
        "is_target": "false",
        "name": "CATS2D_07_DP",
        "number_of_missing_values": "0"
      },
      {
        "data_type": "numeric",
        "index": "18",
        "is_ignore": "false",
        "is_row_identifier": "false",
        "is_target": "false",
        "name": "ATSC8v",
        "number_of_missing_values": "0"
      },
      {
        "data_type": "numeric",
        "index": "19",
        "is_ignore": "false",
        "is_row_identifier": "false",
        "is_target": "false",
        "name": "Eta_C",
        "number_of_missing_values": "0"
      },
      {
        "data_type": "numeric",
        "index": "20",
        "is_ignore": "false",
        "is_row_identifier": "false",
        "is_target": "false",
        "name": "ATS6i",
        "number_of_missing_values": "0"
      },
      {
        "data_type": "numeric",
        "index": "21",
        "is_ignore": "false",
        "is_row_identifier": "false",
        "is_target": "false",
        "name": "S3K",
        "number_of_missing_values": "0"
      },
      {
        "data_type": "numeric",
        "index": "22",
        "is_ignore": "false",
        "is_row_identifier": "false",
        "is_target": "false",
        "name": "GATS8p",
        "number_of_missing_values": "0"
      },
      {
        "data_type": "numeric",
        "index": "23",
        "is_ignore": "false",
        "is_row_identifier": "false",
        "is_target": "false",
        "name": "ATS8s",
        "number_of_missing_values": "0"
      },
      {
        "data_type": "numeric",
        "index": "24",
        "is_ignore": "false",
        "is_row_identifier": "false",
        "is_target": "false",
        "name": "ATS4e",
        "number_of_missing_values": "0"
      },
      {
        "data_type": "numeric",
        "index": "25",
        "is_ignore": "false",
        "is_row_identifier": "false",
        "is_target": "false",
        "name": "ATSC5s",
        "number_of_missing_values": "0"
      },
      {
        "data_type": "numeric",
        "index": "26",
        "is_ignore": "false",
        "is_row_identifier": "false",
        "is_target": "false",
        "name": "CATS2D_06_DA",
        "number_of_missing_values": "0"
      },
      {
        "data_type": "numeric",
        "index": "27",
        "is_ignore": "false",
        "is_row_identifier": "false",
        "is_target": "false",
        "name": "ATS8i",
        "number_of_missing_values": "0"
      },
      {
        "data_type": "numeric",
        "index": "28",
        "is_ignore": "false",
        "is_row_identifier": "false",
        "is_target": "false",
        "name": "SpMin4_Bh.p.",
        "number_of_missing_values": "0"
      },
      {
        "data_type": "numeric",
        "index": "29",
        "is_ignore": "false",
        "is_row_identifier": "false",
        "is_target": "false",
        "name": "P_VSA_e_1",
        "number_of_missing_values": "0"
      },
      {
        "data_type": "numeric",
        "index": "30",
        "is_ignore": "false",
        "is_row_identifier": "false",
        "is_target": "false",
        "name": "P_VSA_m_1",
        "number_of_missing_values": "0"
      },
      {
        "data_type": "numeric",
        "index": "31",
        "is_ignore": "false",
        "is_row_identifier": "false",
        "is_target": "false",
        "name": "P_VSA_p_1",
        "number_of_missing_values": "0"
      },
      {
        "data_type": "numeric",
        "index": "32",
        "is_ignore": "false",
        "is_row_identifier": "false",
        "is_target": "false",
        "name": "P_VSA_s_2",
        "number_of_missing_values": "0"
      },
      {
        "data_type": "numeric",
        "index": "33",
        "is_ignore": "false",
        "is_row_identifier": "false",
        "is_target": "false",
        "name": "P_VSA_v_1",
        "number_of_missing_values": "0"
      },
      {
        "data_type": "numeric",
        "index": "34",
        "is_ignore": "false",
        "is_row_identifier": "false",
        "is_target": "false",
        "name": "SpMin4_Bh.v.",
        "number_of_missing_values": "0"
      },
      {
        "data_type": "numeric",
        "index": "35",
        "is_ignore": "false",
        "is_row_identifier": "false",
        "is_target": "false",
        "name": "CATS2D_04_DL",
        "number_of_missing_values": "0"
      },
      {
        "data_type": "numeric",
        "index": "36",
        "is_ignore": "false",
        "is_row_identifier": "false",
        "is_target": "false",
        "name": "ATSC5m",
        "number_of_missing_values": "0"
      },
      {
        "data_type": "numeric",
        "index": "37",
        "is_ignore": "false",
        "is_row_identifier": "false",
        "is_target": "false",
        "name": "ATS5e",
        "number_of_missing_values": "0"
      },
      {
        "data_type": "numeric",
        "index": "38",
        "is_ignore": "false",
        "is_row_identifier": "false",
        "is_target": "false",
        "name": "ATSC3v",
        "number_of_missing_values": "0"
      },
      {
        "data_type": "numeric",
        "index": "39",
        "is_ignore": "false",
        "is_row_identifier": "false",
        "is_target": "false",
        "name": "ATS7e",
        "number_of_missing_values": "0"
      },
      {
        "data_type": "numeric",
        "index": "40",
        "is_ignore": "false",
        "is_row_identifier": "false",
        "is_target": "false",
        "name": "ATS7i",
        "number_of_missing_values": "0"
      },
      {
        "data_type": "numeric",
        "index": "41",
        "is_ignore": "false",
        "is_row_identifier": "false",
        "is_target": "false",
        "name": "ATSC7v",
        "number_of_missing_values": "0"
      },
      {
        "data_type": "numeric",
        "index": "42",
        "is_ignore": "false",
        "is_row_identifier": "false",
        "is_target": "false",
        "name": "ATSC8m",
        "number_of_missing_values": "0"
      },
      {
        "data_type": "numeric",
        "index": "43",
        "is_ignore": "false",
        "is_row_identifier": "false",
        "is_target": "false",
        "name": "ATS5i",
        "number_of_missing_values": "0"
      },
      {
        "data_type": "numeric",
        "index": "44",
        "is_ignore": "false",
        "is_row_identifier": "false",
        "is_target": "false",
        "name": "ATS2i",
        "number_of_missing_values": "0"
      },
      {
        "data_type": "numeric",
        "index": "45",
        "is_ignore": "false",
        "is_row_identifier": "false",
        "is_target": "false",
        "name": "ATS3e",
        "number_of_missing_values": "0"
      },
      {
        "data_type": "numeric",
        "index": "46",
        "is_ignore": "false",
        "is_row_identifier": "false",
        "is_target": "false",
        "name": "D.Dtr05",
        "number_of_missing_values": "0"
      },
      {
        "data_type": "numeric",
        "index": "47",
        "is_ignore": "false",
        "is_row_identifier": "false",
        "is_target": "false",
        "name": "ATS6e",
        "number_of_missing_values": "0"
      },
      {
        "data_type": "numeric",
        "index": "48",
        "is_ignore": "false",
        "is_row_identifier": "false",
        "is_target": "false",
        "name": "ATSC2v",
        "number_of_missing_values": "0"
      },
      {
        "data_type": "numeric",
        "index": "49",
        "is_ignore": "false",
        "is_row_identifier": "false",
        "is_target": "false",
        "name": "ATS3i",
        "number_of_missing_values": "0"
      },
      {
        "data_type": "numeric",
        "index": "50",
        "is_ignore": "false",
        "is_row_identifier": "false",
        "is_target": "false",
        "name": "nCsp3",
        "number_of_missing_values": "0"
      },
      {
        "data_type": "numeric",
        "index": "51",
        "is_ignore": "false",
        "is_row_identifier": "false",
        "is_target": "false",
        "name": "SpMin4_Bh.i.",
        "number_of_missing_values": "0"
      },
      {
        "data_type": "numeric",
        "index": "52",
        "is_ignore": "false",
        "is_row_identifier": "false",
        "is_target": "false",
        "name": "NssCH2",
        "number_of_missing_values": "0"
      },
      {
        "data_type": "numeric",
        "index": "53",
        "is_ignore": "false",
        "is_row_identifier": "false",
        "is_target": "false",
        "name": "CATS2D_09_AP",
        "number_of_missing_values": "0"
      },
      {
        "data_type": "numeric",
        "index": "54",
        "is_ignore": "false",
        "is_row_identifier": "false",
        "is_target": "false",
        "name": "ATS8e",
        "number_of_missing_values": "0"
      },
      {
        "data_type": "numeric",
        "index": "55",
        "is_ignore": "false",
        "is_row_identifier": "false",
        "is_target": "false",
        "name": "ATSC6m",
        "number_of_missing_values": "0"
      },
      {
        "data_type": "numeric",
        "index": "56",
        "is_ignore": "false",
        "is_row_identifier": "false",
        "is_target": "false",
        "name": "nCrs",
        "number_of_missing_values": "0"
      },
      {
        "data_type": "numeric",
        "index": "57",
        "is_ignore": "false",
        "is_row_identifier": "false",
        "is_target": "false",
        "name": "Eta_L",
        "number_of_missing_values": "0"
      },
      {
        "data_type": "numeric",
        "index": "58",
        "is_ignore": "false",
        "is_row_identifier": "false",
        "is_target": "false",
        "name": "CATS2D_09_DA",
        "number_of_missing_values": "0"
      },
      {
        "data_type": "numeric",
        "index": "59",
        "is_ignore": "false",
        "is_row_identifier": "false",
        "is_target": "false",
        "name": "piID",
        "number_of_missing_values": "0"
      },
      {
        "data_type": "numeric",
        "index": "60",
        "is_ignore": "false",
        "is_row_identifier": "false",
        "is_target": "false",
        "name": "CATS2D_08_LL",
        "number_of_missing_values": "0"
      },
      {
        "data_type": "numeric",
        "index": "61",
        "is_ignore": "false",
        "is_row_identifier": "false",
        "is_target": "false",
        "name": "CIC0",
        "number_of_missing_values": "0"
      },
      {
        "data_type": "numeric",
        "index": "62",
        "is_ignore": "false",
        "is_row_identifier": "false",
        "is_target": "false",
        "name": "ATSC6v",
        "number_of_missing_values": "0"
      },
      {
        "data_type": "numeric",
        "index": "63",
        "is_ignore": "false",
        "is_row_identifier": "false",
        "is_target": "false",
        "name": "ATS5s",
        "number_of_missing_values": "0"
      },
      {
        "data_type": "numeric",
        "index": "64",
        "is_ignore": "false",
        "is_row_identifier": "false",
        "is_target": "false",
        "name": "SpMin4_Bh.e.",
        "number_of_missing_values": "0"
      },
      {
        "data_type": "numeric",
        "index": "65",
        "is_ignore": "false",
        "is_row_identifier": "false",
        "is_target": "false",
        "name": "SpMin2_Bh.s.",
        "number_of_missing_values": "0"
      },
      {
        "data_type": "numeric",
        "index": "66",
        "is_ignore": "false",
        "is_row_identifier": "false",
        "is_target": "true",
        "name": "pXC50",
        "number_of_missing_values": "0"
      }
    ]
  }
}