{
  "data_features": {
    "feature": [
      {
        "data_type": "nominal",
        "index": "0",
        "is_ignore": "false",
        "is_row_identifier": "true",
        "is_target": "false",
        "name": "molecule_id",
        "nominal_value": [
          "CHEMBL137400",
          "CHEMBL18745",
          "CHEMBL192",
          "CHEMBL278644",
          "CHEMBL304161",
          "CHEMBL305617",
          "CHEMBL305618",
          "CHEMBL305988",
          "CHEMBL308249",
          "CHEMBL344944",
          "CHEMBL357428",
          "CHEMBL431377",
          "CHEMBL508705",
          "CHEMBL538498",
          "CHEMBL539783",
          "CHEMBL540031",
          "CHEMBL540294",
          "CHEMBL540539",
          "CHEMBL541818",
          "CHEMBL541823",
          "CHEMBL542410",
          "CHEMBL544289",
          "CHEMBL553371",
          "CHEMBL553786",
          "CHEMBL68152",
          "CHEMBL70569",
          "CHEMBL77971"
        ],
        "number_of_missing_values": "0"
      },
      {
        "data_type": "numeric",
        "index": "1",
        "is_ignore": "false",
        "is_row_identifier": "false",
        "is_target": "false",
        "name": "Mv",
        "number_of_missing_values": "0"
      },
      {
        "data_type": "numeric",
        "index": "2",
        "is_ignore": "false",
        "is_row_identifier": "false",
        "is_target": "false",
        "name": "nO",
        "number_of_missing_values": "0"
      },
      {
        "data_type": "numeric",
        "index": "3",
        "is_ignore": "false",
        "is_row_identifier": "false",
        "is_target": "true",
        "name": "pXC50",
        "number_of_missing_values": "0"
      }
    ]
  }
}