"molecule_id","AMW","C.","pXC50"
{1 7.581,2 39.3,3 4.301}
{0 CHEMBL309216,1 6.441,2 29.4,3 6.503}
{0 CHEMBL309274,1 6.441,2 29.4,3 4.147}
{0 CHEMBL311875,1 6.964,2 34.8,3 5.377}
{0 CHEMBL311925,1 6.949,2 36,3 5.331}
{0 CHEMBL420207,1 6.441,2 29.4,3 6.762}
{0 CHEMBL78505,1 7.286,2 33.3,3 5.511}
{0 CHEMBL78699,1 6.938,2 35.7,3 4.077}
{0 CHEMBL79083,1 7.124,2 31.8,3 4.712}
{0 CHEMBL79092,1 7.463,2 34.4,3 4.852}
{0 CHEMBL80368,1 6.95,2 31.4,3 4.499}
{0 CHEMBL81423,1 6.441,2 29.4,3 4.516}
