"molecule_id","FCFP4_1024b124","FCFP4_1024b360","FCFP4_1024b455","FCFP4_1024b868","FCFP4_1024b862","FCFP4_1024b668","FCFP4_1024b943","FCFP4_1024b799","FCFP4_1024b396","FCFP4_1024b653","FCFP4_1024b937","FCFP4_1024b464","FCFP4_1024b728","FCFP4_1024b614","FCFP4_1024b714","FCFP4_1024b589","FCFP4_1024b948","FCFP4_1024b872","FCFP4_1024b401","FCFP4_1024b31","FCFP4_1024b695","FCFP4_1024b524","FCFP4_1024b78","FCFP4_1024b8","FCFP4_1024b492","FCFP4_1024b603","FCFP4_1024b35","FCFP4_1024b884","FCFP4_1024b187","FCFP4_1024b888","FCFP4_1024b908","FCFP4_1024b821","FCFP4_1024b698","FCFP4_1024b365","FCFP4_1024b657","FCFP4_1024b152","FCFP4_1024b574","FCFP4_1024b531","FCFP4_1024b754","FCFP4_1024b32","FCFP4_1024b429","FCFP4_1024b986","FCFP4_1024b847","FCFP4_1024b669","FCFP4_1024b461","FCFP4_1024b859","FCFP4_1024b978","FCFP4_1024b61","FCFP4_1024b601","FCFP4_1024b459","FCFP4_1024b4","pXC50"
{3 1,8 1,15 1,23 1,26 1,36 1,43 1,51 1,52 5}
{0 CHEMBL1086461,1 1,2 1,3 1,4 1,5 1,6 1,7 1,8 1,9 1,10 1,11 1,12 1,13 1,14 1,15 1,16 1,17 1,18 1,19 1,20 1,21 1,22 1,23 1,24 1,25 1,26 1,28 1,29 1,30 1,31 1,32 1,33 1,34 1,35 1,36 1,37 1,38 1,41 1,42 1,43 1,44 1,46 1,51 1,52 6.155}
{0 CHEMBL1086462,1 1,2 1,3 1,4 1,5 1,6 1,7 1,8 1,9 1,10 1,11 1,12 1,13 1,14 1,15 1,16 1,17 1,18 1,19 1,20 1,21 1,22 1,23 1,24 1,25 1,26 1,28 1,29 1,30 1,31 1,32 1,33 1,34 1,35 1,36 1,37 1,38 1,41 1,42 1,43 1,44 1,51 1,52 9}
{0 CHEMBL1086463,1 1,2 1,3 1,4 1,5 1,6 1,7 1,8 1,9 1,10 1,11 1,12 1,13 1,14 1,15 1,16 1,17 1,18 1,19 1,20 1,21 1,22 1,23 1,24 1,25 1,26 1,28 1,29 1,30 1,31 1,32 1,33 1,34 1,35 1,36 1,37 1,38 1,41 1,42 1,43 1,44 1,46 1,51 1,52 5.081}
{0 CHEMBL1172376,1 1,2 1,3 1,4 1,5 1,6 1,7 1,8 1,9 1,10 1,11 1,12 1,13 1,14 1,15 1,16 1,17 1,18 1,19 1,20 1,21 1,22 1,23 1,24 1,25 1,26 1,28 1,29 1,30 1,31 1,32 1,33 1,34 1,35 1,36 1,37 1,38 1,41 1,42 1,43 1,44 1,47 1,51 1,52 7.975}
{0 CHEMBL1200485,6 1,26 1,32 1,51 1,52 4.836}
{0 CHEMBL1210154,29 1,43 1,45 1,51 1,52 5}
{0 CHEMBL1242923,8 1,15 1,23 1,26 1,34 1,36 1,37 1,41 1,42 1,44 1,45 1,51 1,52 6}
{0 CHEMBL1242950,37 1,41 1,43 1,45 1,50 1,52 6}
{0 CHEMBL129953,1 1,2 1,3 1,4 1,5 1,6 1,7 1,8 1,9 1,10 1,11 1,12 1,13 1,14 1,15 1,16 1,17 1,18 1,19 1,20 1,21 1,22 1,23 1,24 1,25 1,26 1,27 1,28 1,29 1,30 1,31 1,32 1,33 1,34 1,36 1,37 1,39 1,40 1,41 1,42 1,43 1,44 1,49 1,50 1,51 1,52 9.469}
{0 CHEMBL1299997,43 1,48 1,52 5.371}
{0 CHEMBL1301125,36 1,37 1,42 1,45 1,52 5.485}
{0 CHEMBL1302946,26 1,36 1,42 1,45 1,48 1,51 1,52 4.886}
{0 CHEMBL1303193,16 1,41 1,45 1,46 1,52 5.237}
{0 CHEMBL1308657,16 1,41 1,45 1,46 1,52 5.445}
{0 CHEMBL1310644,32 1,44 1,48 1,52 4.65}
{0 CHEMBL1312502,17 1,31 1,44 1,45 1,51 1,52 5.222}
{0 CHEMBL1318749,14 1,41 1,45 1,48 1,52 4.799}
{0 CHEMBL1321527,32 1,45 1,51 1,52 5.092}
{0 CHEMBL1322180,14 1,25 1,43 1,44 1,45 1,46 1,51 1,52 4.848}
{0 CHEMBL1322309,11 1,18 1,24 1,28 1,29 1,30 1,33 1,41 1,45 1,48 1,52 4.565}
{0 CHEMBL1323442,16 1,25 1,36 1,43 1,44 1,51 1,52 5.475}
{0 CHEMBL132409,1 1,2 1,3 1,4 1,5 1,6 1,7 1,8 1,9 1,10 1,11 1,12 1,13 1,14 1,15 1,16 1,17 1,18 1,19 1,20 1,21 1,22 1,23 1,24 1,25 1,26 1,27 1,28 1,29 1,30 1,31 1,32 1,33 1,34 1,35 1,36 1,37 1,39 1,40 1,41 1,42 1,43 1,44 1,49 1,50 1,51 1,52 9.398}
{0 CHEMBL132507,1 1,2 1,3 1,4 1,5 1,6 1,7 1,8 1,9 1,10 1,11 1,12 1,13 1,14 1,15 1,16 1,17 1,18 1,19 1,20 1,21 1,22 1,23 1,24 1,25 1,26 1,27 1,28 1,29 1,30 1,31 1,32 1,33 1,34 1,36 1,37 1,39 1,40 1,41 1,42 1,43 1,44 1,49 1,50 1,51 1,52 9.398}
{0 CHEMBL1325192,22 1,37 1,41 1,42 1,43 1,45 1,52 4.854}
{0 CHEMBL132524,1 1,2 1,3 1,4 1,5 1,6 1,7 1,8 1,9 1,10 1,11 1,12 1,13 1,14 1,15 1,16 1,17 1,18 1,19 1,20 1,21 1,22 1,23 1,24 1,25 1,26 1,27 1,28 1,29 1,30 1,31 1,32 1,33 1,34 1,36 1,37 1,39 1,40 1,41 1,42 1,43 1,44 1,46 1,49 1,50 1,51 1,52 9.523}
{0 CHEMBL1325640,24 1,32 1,35 1,48 1,52 5.043}
{0 CHEMBL132794,1 1,2 1,3 1,4 1,5 1,6 1,7 1,8 1,9 1,10 1,11 1,12 1,13 1,14 1,15 1,16 1,17 1,18 1,19 1,20 1,21 1,22 1,23 1,24 1,25 1,26 1,27 1,28 1,29 1,30 1,31 1,32 1,33 1,34 1,36 1,37 1,39 1,40 1,41 1,42 1,43 1,44 1,49 1,50 1,51 1,52 9.292}
{0 CHEMBL1328169,45 1,52 5.207}
{0 CHEMBL1328510,18 1,37 1,41 1,42 1,43 1,44 1,45 1,52 4.801}
{0 CHEMBL1328520,4 1,15 1,23 1,31 1,41 1,43 1,52 5.027}
{0 CHEMBL1330390,24 1,26 1,36 1,42 1,45 1,48 1,51 1,52 5.043}
{0 CHEMBL1332241,24 1,26 1,31 1,36 1,42 1,45 1,48 1,51 1,52 4.917}
{0 CHEMBL1333191,14 1,36 1,37 1,41 1,42 1,43 1,45 1,52 4.815}
{0 CHEMBL133340,1 1,2 1,3 1,4 1,5 1,6 1,7 1,8 1,9 1,10 1,11 1,12 1,13 1,14 1,15 1,16 1,17 1,18 1,19 1,20 1,21 1,22 1,23 1,24 1,25 1,26 1,27 1,28 1,29 1,30 1,31 1,32 1,33 1,34 1,36 1,37 1,39 1,40 1,41 1,42 1,43 1,44 1,46 1,49 1,50 1,51 1,52 9.62}
{0 CHEMBL133378,1 1,2 1,3 1,4 1,5 1,6 1,7 1,8 1,9 1,10 1,11 1,12 1,13 1,14 1,15 1,16 1,17 1,18 1,19 1,20 1,21 1,22 1,23 1,24 1,25 1,26 1,27 1,28 1,29 1,30 1,31 1,32 1,33 1,34 1,36 1,37 1,39 1,40 1,41 1,42 1,43 1,44 1,49 1,50 1,51 1,52 9.444}
{0 CHEMBL1334291,8 1,21 1,22 1,31 1,37 1,42 1,44 1,45 1,51 1,52 4.721}
{0 CHEMBL1334520,52 4.827}
{0 CHEMBL133798,1 1,2 1,3 1,4 1,5 1,6 1,7 1,8 1,9 1,10 1,11 1,12 1,13 1,14 1,15 1,16 1,17 1,18 1,19 1,20 1,21 1,22 1,23 1,24 1,25 1,26 1,27 1,28 1,29 1,30 1,31 1,32 1,33 1,34 1,36 1,37 1,39 1,40 1,41 1,42 1,43 1,44 1,49 1,50 1,51 1,52 8.796}
{0 CHEMBL1338004,18 1,37 1,41 1,42 1,43 1,44 1,45 1,52 4.845}
{0 CHEMBL133849,1 1,2 1,3 1,4 1,5 1,6 1,7 1,8 1,9 1,10 1,11 1,12 1,13 1,14 1,15 1,16 1,17 1,18 1,19 1,20 1,21 1,22 1,23 1,24 1,25 1,26 1,27 1,28 1,29 1,30 1,31 1,32 1,33 1,34 1,36 1,37 1,39 1,40 1,41 1,42 1,43 1,44 1,46 1,49 1,50 1,51 1,52 9.284}
{0 CHEMBL133850,1 1,2 1,3 1,4 1,5 1,6 1,7 1,8 1,9 1,10 1,11 1,12 1,13 1,14 1,15 1,16 1,17 1,18 1,19 1,20 1,21 1,22 1,23 1,24 1,25 1,26 1,27 1,28 1,29 1,30 1,31 1,32 1,33 1,34 1,36 1,37 1,39 1,40 1,41 1,42 1,43 1,44 1,49 1,50 1,51 1,52 9.553}
{0 CHEMBL1340713,24 1,28 1,29 1,30 1,33 1,40 1,43 1,48 1,52 5.12}
{0 CHEMBL1344250,18 1,41 1,44 1,45 1,52 4.421}
{0 CHEMBL1344927,26 1,31 1,36 1,42 1,48 1,51 1,52 4.9}
{0 CHEMBL1346595,17 1,22 1,23 1,37 1,41 1,42 1,43 1,51 1,52 4.52}
{0 CHEMBL1348181,41 1,44 1,45 1,51 1,52 4.507}
{0 CHEMBL1349747,36 1,51 1,52 4.759}
{0 CHEMBL1350888,18 1,21 1,24 1,25 1,31 1,37 1,41 1,42 1,43 1,44 1,51 1,52 4.684}
{0 CHEMBL1358861,26 1,31 1,36 1,41 1,42 1,45 1,51 1,52 4.417}
{0 CHEMBL1359756,25 1,31 1,41 1,42 1,43 1,44 1,48 1,51 1,52 4.783}
{0 CHEMBL1361814,37 1,41 1,42 1,44 1,52 4.745}
{0 CHEMBL1364769,34 1,45 1,48 1,52 4.821}
{0 CHEMBL1367491,31 1,37 1,41 1,42 1,44 1,45 1,52 4.398}
{0 CHEMBL1369296,24 1,28 1,29 1,30 1,33 1,42 1,48 1,52 5.081}
{0 CHEMBL1369594,45 1,48 1,52 4.9}
{0 CHEMBL1370953,31 1,42 1,43 1,44 1,45 1,52 4.745}
{0 CHEMBL1372112,44 1,45 1,52 4.481}
{0 CHEMBL1375998,6 1,36 1,43 1,45 1,48 1,51 1,52 4.876}
{0 CHEMBL1379298,4 1,26 1,36 1,37 1,41 1,42 1,44 1,51 1,52 4.398}
{0 CHEMBL1380459,31 1,41 1,42 1,43 1,44 1,51 1,52 4.733}
{0 CHEMBL1380969,15 1,25 1,31 1,37 1,41 1,44 1,45 1,48 1,50 1,51 1,52 4.733}
{0 CHEMBL1384177,24 1,25 1,26 1,28 1,29 1,30 1,33 1,34 1,36 1,37 1,41 1,44 1,45 1,46 1,51 1,52 4.398}
{0 CHEMBL1385214,36 1,37 1,41 1,51 1,52 5.086}
{0 CHEMBL1387563,29 1,34 1,42 1,45 1,48 1,52 5.103}
{0 CHEMBL138970,1 1,2 1,3 1,4 1,5 1,6 1,7 1,8 1,9 1,10 1,11 1,12 1,13 1,14 1,15 1,16 1,17 1,18 1,21 1,22 1,23 1,24 1,25 1,26 1,27 1,28 1,29 1,30 1,31 1,33 1,34 1,36 1,37 1,38 1,39 1,40 1,41 1,42 1,43 1,44 1,46 1,51 1,52 8.886}
{0 CHEMBL1390127,24 1,26 1,36 1,42 1,48 1,51 1,52 4.975}
{0 CHEMBL1390663,12 1,32 1,33 1,34 1,36 1,41 1,42 1,44 1,45 1,51 1,52 5.177}
{0 CHEMBL1390986,43 1,44 1,51 1,52 4.762}
{0 CHEMBL1393507,34 1,45 1,51 1,52 4.398}
{0 CHEMBL139727,1 1,2 1,3 1,4 1,5 1,6 1,7 1,8 1,9 1,10 1,11 1,12 1,14 1,15 1,17 1,18 1,21 1,22 1,23 1,24 1,25 1,26 1,27 1,28 1,29 1,30 1,31 1,33 1,34 1,36 1,37 1,39 1,40 1,41 1,42 1,43 1,44 1,46 1,51 1,52 8.056}
{0 CHEMBL1399212,34 1,41 1,48 1,52 4.493}
{0 CHEMBL1403329,25 1,34 1,37 1,46 1,51 1,52 4.879}
{0 CHEMBL1404113,34 1,48 1,52 4.398}
{0 CHEMBL1405092,14 1,37 1,41 1,42 1,45 1,52 4.833}
{0 CHEMBL1405919,31 1,41 1,42 1,43 1,44 1,45 1,48 1,52 4.824}
{0 CHEMBL1407659,44 1,45 1,52 5.008}
{0 CHEMBL1409423,14 1,26 1,29 1,41 1,42 1,44 1,45 1,46 1,51 1,52 4.747}
{0 CHEMBL1417142,17 1,21 1,26 1,43 1,45 1,51 1,52 4.62}
{0 CHEMBL141872,1 1,2 1,3 1,4 1,5 1,6 1,7 1,8 1,9 1,10 1,11 1,12 1,14 1,15 1,17 1,18 1,21 1,22 1,23 1,24 1,25 1,26 1,27 1,28 1,29 1,30 1,31 1,33 1,34 1,36 1,37 1,39 1,40 1,41 1,42 1,43 1,44 1,46 1,51 1,52 8.409}
{0 CHEMBL141910,1 1,2 1,3 1,4 1,5 1,6 1,7 1,8 1,9 1,10 1,11 1,12 1,14 1,15 1,17 1,18 1,21 1,22 1,23 1,24 1,26 1,27 1,28 1,29 1,30 1,31 1,33 1,34 1,36 1,37 1,39 1,40 1,41 1,42 1,43 1,44 1,46 1,51 1,52 7.553}
{0 CHEMBL1419585,13 1,15 1,23 1,25 1,26 1,37 1,46 1,51 1,52 4.77}
{0 CHEMBL1420175,49 1,52 5.01}
{0 CHEMBL1420229,14 1,41 1,45 1,48 1,52 4.799}
{0 CHEMBL1421296,15 1,25 1,36 1,41 1,43 1,44 1,51 1,52 4.646}
{0 CHEMBL1421442,17 1,31 1,44 1,45 1,51 1,52 4.613}
{0 CHEMBL1422262,15 1,22 1,25 1,26 1,37 1,41 1,43 1,44 1,45 1,46 1,51 1,52 4.668}
{0 CHEMBL1425186,24 1,28 1,29 1,30 1,33 1,43 1,45 1,49 1,51 1,52 4.799}
{0 CHEMBL1429003,41 1,42 1,43 1,44 1,45 1,48 1,52 4.638}
{0 CHEMBL1429636,24 1,26 1,36 1,42 1,45 1,48 1,51 1,52 4.987}
{0 CHEMBL1433015,14 1,41 1,45 1,48 1,52 4.921}
{0 CHEMBL1438069,22 1,37 1,41 1,42 1,43 1,44 1,51 1,52 5.133}
{0 CHEMBL1438983,25 1,26 1,45 1,46 1,51 1,52 4.818}
{0 CHEMBL1439624,45 1,52 4.9}
{0 CHEMBL1442136,23 1,26 1,30 1,32 1,34 1,36 1,42 1,45 1,46 1,51 1,52 5.602}
{0 CHEMBL1444683,37 1,41 1,43 1,45 1,46 1,51 1,52 4.492}
{0 CHEMBL1444767,4 1,15 1,37 1,45 1,51 1,52 4.708}
{0 CHEMBL1446377,37 1,41 1,44 1,45 1,52 5.208}
{0 CHEMBL1446971,32 1,36 1,41 1,43 1,44 1,45 1,48 1,51 1,52 5.006}
{0 CHEMBL1447076,25 1,37 1,51 1,52 4.602}
{0 CHEMBL1448732,45 1,51 1,52 4.585}
{0 CHEMBL1448941,6 1,18 1,21 1,31 1,37 1,42 1,44 1,45 1,48 1,51 1,52 4.754}
{0 CHEMBL1450446,15 1,25 1,31 1,37 1,41 1,44 1,45 1,48 1,50 1,51 1,52 4.73}
{0 CHEMBL1452114,14 1,36 1,37 1,41 1,42 1,43 1,45 1,52 4.752}
{0 CHEMBL1452379,33 1,34 1,36 1,43 1,45 1,48 1,51 1,52 4.775}
{0 CHEMBL1453900,32 1,45 1,51 1,52 5.12}
{0 CHEMBL1458403,15 1,25 1,26 1,37 1,41 1,43 1,44 1,45 1,46 1,51 1,52 4.701}
{0 CHEMBL1461171,6 1,37 1,43 1,44 1,45 1,51 1,52 4.398}
{0 CHEMBL1461496,45 1,51 1,52 5.105}
{0 CHEMBL1461508,23 1,34 1,36 1,37 1,38 1,41 1,43 1,45 1,51 1,52 5.01}
{0 CHEMBL1464832,8 1,15 1,23 1,26 1,34 1,36 1,37 1,43 1,44 1,45 1,51 1,52 5.032}
{0 CHEMBL1466699,26 1,36 1,42 1,45 1,48 1,51 1,52 4.821}
{0 CHEMBL1467999,23 1,34 1,36 1,41 1,45 1,51 1,52 4.53}
{0 CHEMBL1468368,14 1,26 1,32 1,36 1,41 1,44 1,45 1,48 1,51 1,52 5.385}
{0 CHEMBL1470682,13 1,23 1,26 1,31 1,34 1,36 1,42 1,44 1,45 1,48 1,51 1,52 4.406}
{0 CHEMBL1470914,41 1,42 1,43 1,44 1,48 1,52 4.79}
{0 CHEMBL1482193,37 1,45 1,52 4.833}
{0 CHEMBL1482308,32 1,34 1,44 1,51 1,52 4.398}
{0 CHEMBL1483562,24 1,28 1,29 1,30 1,33 1,36 1,45 1,48 1,51 1,52 5.175}
{0 CHEMBL1483683,22 1,37 1,41 1,42 1,43 1,44 1,45 1,52 4.703}
{0 CHEMBL1484272,34 1,41 1,45 1,48 1,52 5.027}
{0 CHEMBL1488408,41 1,45 1,52 4.796}
{0 CHEMBL1489769,2 1,9 1,10 1,15 1,22 1,23 1,24 1,25 1,30 1,33 1,37 1,39 1,40 1,41 1,43 1,51 1,52 4.516}
{0 CHEMBL1490267,6 1,11 1,24 1,28 1,29 1,30 1,33 1,51 1,52 5.018}
{0 CHEMBL1490404,17 1,34 1,51 1,52 5.42}
{0 CHEMBL1490916,3 1,12 1,15 1,21 1,23 1,26 1,31 1,34 1,37 1,42 1,43 1,44 1,45 1,51 1,52 4.492}
{0 CHEMBL1493442,17 1,34 1,41 1,51 1,52 5.05}
{0 CHEMBL1497243,2 1,24 1,42 1,43 1,44 1,48 1,52 4.796}
{0 CHEMBL1499313,24 1,25 1,26 1,28 1,29 1,30 1,33 1,34 1,36 1,37 1,45 1,46 1,48 1,51 1,52 4.636}
{0 CHEMBL1501508,16 1,41 1,46 1,52 5.62}
{0 CHEMBL1502512,18 1,21 1,31 1,37 1,42 1,44 1,52 5.059}
{0 CHEMBL1503962,24 1,28 1,30 1,33 1,40 1,43 1,45 1,48 1,52 4.738}
{0 CHEMBL1509980,26 1,36 1,42 1,43 1,48 1,51 1,52 4.721}
{0 CHEMBL1511193,3 1,6 1,12 1,15 1,21 1,23 1,26 1,34 1,42 1,43 1,45 1,51 1,52 4.747}
{0 CHEMBL1518625,18 1,37 1,43 1,44 1,45 1,51 1,52 4.752}
{0 CHEMBL1523597,24 1,28 1,29 1,30 1,33 1,34 1,45 1,51 1,52 4.815}
{0 CHEMBL1528569,34 1,37 1,43 1,45 1,48 1,52 4.452}
{0 CHEMBL1528880,25 1,37 1,42 1,43 1,45 1,51 1,52 4.658}
{0 CHEMBL1530988,48 1,52 4.943}
{0 CHEMBL1531686,32 1,41 1,42 1,45 1,52 4.585}
{0 CHEMBL1535216,10 1,22 1,26 1,32 1,36 1,37 1,41 1,48 1,51 1,52 4.896}
{0 CHEMBL1538066,5 1,12 1,15 1,17 1,21 1,26 1,37 1,38 1,41 1,42 1,43 1,45 1,51 1,52 5.268}
{0 CHEMBL1540679,23 1,24 1,31 1,41 1,42 1,43 1,44 1,45 1,52 5.381}
{0 CHEMBL1541329,6 1,23 1,36 1,43 1,44 1,45 1,51 1,52 4.991}
{0 CHEMBL1541520,14 1,41 1,43 1,44 1,45 1,51 1,52 4.398}
{0 CHEMBL1543298,24 1,28 1,29 1,30 1,33 1,45 1,51 1,52 4.514}
{0 CHEMBL1544423,23 1,34 1,36 1,43 1,51 1,52 4.752}
{0 CHEMBL1546134,33 1,34 1,36 1,43 1,45 1,48 1,51 1,52 5.289}
{0 CHEMBL1546782,41 1,42 1,43 1,44 1,45 1,48 1,52 4.857}
{0 CHEMBL1547420,34 1,41 1,42 1,48 1,52 5.223}
{0 CHEMBL1549599,36 1,37 1,41 1,42 1,44 1,51 1,52 4.398}
{0 CHEMBL1549706,10 1,17 1,22 1,26 1,36 1,37 1,41 1,42 1,43 1,51 1,52 4.74}
{0 CHEMBL1550591,42 1,45 1,48 1,52 5.177}
{0 CHEMBL1550862,45 1,48 1,52 5.072}
{0 CHEMBL1552591,24 1,28 1,29 1,30 1,33 1,45 1,52 4.561}
{0 CHEMBL1563110,45 1,51 1,52 4.538}
{0 CHEMBL1563372,21 1,23 1,31 1,34 1,37 1,41 1,44 1,45 1,52 4.78}
{0 CHEMBL1571258,26 1,32 1,36 1,45 1,48 1,51 1,52 4.951}
{0 CHEMBL1577072,32 1,41 1,43 1,44 1,45 1,51 1,52 5.014}
{0 CHEMBL1577981,16 1,41 1,45 1,46 1,52 5.536}
{0 CHEMBL1580134,14 1,36 1,41 1,45 1,51 1,52 4.616}
{0 CHEMBL1583665,32 1,41 1,43 1,44 1,45 1,48 1,52 5.02}
{0 CHEMBL1585318,11 1,41 1,44 1,45 1,52 4.67}
{0 CHEMBL1586169,22 1,37 1,41 1,42 1,43 1,45 1,52 5.053}
{0 CHEMBL1586252,36 1,51 1,52 5.205}
{0 CHEMBL1589062,16 1,41 1,46 1,52 5.243}
{0 CHEMBL1594369,24 1,28 1,29 1,30 1,33 1,42 1,43 1,44 1,45 1,48 1,52 5.181}
{0 CHEMBL1595121,42 1,43 1,48 1,52 5.125}
{0 CHEMBL1597454,34 1,37 1,42 1,43 1,44 1,46 1,51 1,52 5.234}
{0 CHEMBL1599120,2 1,24 1,37 1,41 1,43 1,52 4.708}
{0 CHEMBL1599610,45 1,48 1,52 4.588}
{0 CHEMBL1599740,41 1,44 1,45 1,52 4.445}
{0 CHEMBL1599800,23 1,26 1,34 1,37 1,41 1,43 1,44 1,45 1,51 1,52 5.042}
{0 CHEMBL1600146,26 1,32 1,36 1,43 1,44 1,48 1,51 1,52 5.408}
{0 CHEMBL1601394,2 1,9 1,14 1,15 1,22 1,24 1,25 1,28 1,29 1,30 1,33 1,41 1,46 1,51 1,52 5.567}
{0 CHEMBL1606390,44 1,45 1,52 4.578}
{0 CHEMBL1608453,15 1,36 1,37 1,45 1,51 1,52 5.063}
{0 CHEMBL1609930,33 1,45 1,51 1,52 4.398}
{0 CHEMBL1611170,14 1,32 1,41 1,42 1,43 1,44 1,48 1,52 5.41}
{0 CHEMBL1611686,45 1,52 5.126}
{0 CHEMBL1611796,24 1,28 1,29 1,30 1,33 1,41 1,42 1,48 1,52 4.917}
{0 CHEMBL1612634,41 1,52 4.996}
{0 CHEMBL1613675,18 1,21 1,31 1,37 1,43 1,44 1,51 1,52 5.177}
{0 CHEMBL1628679,2 1,6 1,24 1,26 1,37 1,41 1,43 1,45 1,51 1,52 8.469}
{0 CHEMBL1698682,25 1,36 1,42 1,44 1,48 1,51 1,52 4.724}
{0 CHEMBL1702299,26 1,31 1,42 1,43 1,45 1,51 1,52 4.863}
{0 CHEMBL1706262,17 1,22 1,31 1,37 1,41 1,43 1,44 1,45 1,48 1,51 1,52 4.804}
{0 CHEMBL1715091,17 1,21 1,26 1,43 1,45 1,51 1,52 4.701}
{0 CHEMBL1719236,37 1,41 1,43 1,45 1,46 1,51 1,52 4.561}
{0 CHEMBL172313,1 1,2 1,3 1,4 1,5 1,6 1,7 1,8 1,9 1,10 1,11 1,12 1,13 1,14 1,15 1,16 1,17 1,18 1,19 1,20 1,21 1,22 1,23 1,24 1,25 1,26 1,28 1,29 1,30 1,31 1,32 1,33 1,34 1,35 1,36 1,37 1,38 1,41 1,42 1,43 1,44 1,51 1,52 7}
{0 CHEMBL1726559,25 1,41 1,43 1,46 1,51 1,52 4.575}
{0 CHEMBL1727210,12 1,15 1,21 1,26 1,42 1,43 1,45 1,51 1,52 4.712}
{0 CHEMBL1734949,34 1,37 1,43 1,45 1,48 1,52 4.47}
{0 CHEMBL1736159,22 1,37 1,41 1,43 1,46 1,51 1,52 4.812}
{0 CHEMBL1766824,1 1,2 1,3 1,4 1,5 1,6 1,7 1,8 1,9 1,10 1,11 1,12 1,13 1,15 1,16 1,17 1,18 1,21 1,22 1,23 1,24 1,25 1,26 1,28 1,29 1,30 1,31 1,33 1,34 1,36 1,37 1,38 1,41 1,42 1,43 1,44 1,46 1,51 1,52 5.502}
{0 CHEMBL1766825,2 1,5 1,6 1,7 1,8 1,9 1,10 1,11 1,12 1,13 1,15 1,16 1,17 1,18 1,19 1,20 1,21 1,22 1,23 1,24 1,25 1,26 1,27 1,28 1,29 1,30 1,31 1,32 1,33 1,34 1,35 1,36 1,37 1,38 1,39 1,40 1,41 1,42 1,43 1,44 1,51 1,52 4.553}
{0 CHEMBL1766923,1 1,2 1,3 1,4 1,5 1,6 1,7 1,8 1,9 1,10 1,11 1,12 1,13 1,14 1,15 1,16 1,17 1,18 1,19 1,20 1,21 1,22 1,23 1,24 1,25 1,26 1,27 1,28 1,29 1,30 1,31 1,32 1,33 1,34 1,35 1,36 1,37 1,38 1,39 1,40 1,41 1,42 1,43 1,44 1,51 1,52 8.337}
{0 CHEMBL1766924,1 1,2 1,3 1,4 1,5 1,6 1,7 1,8 1,9 1,10 1,11 1,12 1,13 1,14 1,15 1,16 1,17 1,18 1,19 1,20 1,21 1,22 1,23 1,24 1,25 1,26 1,27 1,28 1,29 1,30 1,31 1,32 1,33 1,34 1,35 1,36 1,37 1,39 1,40 1,41 1,42 1,43 1,44 1,51 1,52 7.959}
{0 CHEMBL1766925,2 1,3 1,5 1,6 1,7 1,8 1,11 1,12 1,13 1,14 1,15 1,17 1,18 1,19 1,20 1,23 1,24 1,25 1,26 1,27 1,28 1,29 1,30 1,31 1,32 1,33 1,34 1,35 1,36 1,37 1,39 1,40 1,41 1,43 1,44 1,51 1,52 7.585}
{0 CHEMBL1766926,1 1,2 1,4 1,5 1,6 1,7 1,8 1,9 1,10 1,11 1,12 1,13 1,15 1,16 1,17 1,18 1,19 1,20 1,21 1,22 1,24 1,25 1,26 1,27 1,31 1,32 1,35 1,36 1,37 1,38 1,39 1,40 1,41 1,42 1,43 1,44 1,51 1,52 5.886}
{0 CHEMBL1766927,1 1,2 1,3 1,4 1,6 1,7 1,8 1,9 1,10 1,11 1,13 1,14 1,15 1,16 1,18 1,19 1,20 1,21 1,22 1,23 1,24 1,25 1,26 1,27 1,28 1,29 1,30 1,31 1,32 1,33 1,34 1,35 1,36 1,37 1,38 1,39 1,40 1,41 1,42 1,43 1,44 1,51 1,52 5.959}
{0 CHEMBL1766928,1 1,2 1,4 1,5 1,6 1,7 1,8 1,9 1,10 1,11 1,12 1,13 1,15 1,16 1,17 1,18 1,19 1,20 1,21 1,22 1,24 1,25 1,26 1,27 1,31 1,32 1,35 1,36 1,37 1,38 1,39 1,40 1,41 1,42 1,43 1,44 1,51 1,52 9.62}
{0 CHEMBL1766929,1 1,2 1,3 1,4 1,5 1,6 1,7 1,8 1,9 1,10 1,11 1,12 1,13 1,14 1,15 1,16 1,17 1,18 1,19 1,20 1,21 1,22 1,23 1,24 1,25 1,26 1,27 1,28 1,29 1,30 1,31 1,32 1,33 1,34 1,35 1,36 1,37 1,38 1,39 1,40 1,41 1,42 1,43 1,44 1,51 1,52 9.215}
{0 CHEMBL1766930,1 1,2 1,3 1,4 1,5 1,6 1,7 1,8 1,9 1,10 1,11 1,12 1,13 1,14 1,15 1,16 1,17 1,18 1,19 1,20 1,21 1,22 1,23 1,24 1,25 1,26 1,27 1,28 1,29 1,30 1,31 1,32 1,33 1,34 1,35 1,36 1,37 1,38 1,39 1,40 1,41 1,42 1,43 1,44 1,51 1,52 7.149}
{0 CHEMBL1766931,1 1,2 1,3 1,4 1,5 1,6 1,7 1,8 1,9 1,10 1,11 1,12 1,13 1,14 1,15 1,16 1,17 1,18 1,19 1,20 1,21 1,22 1,23 1,24 1,25 1,26 1,27 1,28 1,29 1,30 1,31 1,32 1,33 1,34 1,35 1,36 1,37 1,38 1,39 1,40 1,41 1,42 1,43 1,44 1,51 1,52 6.658}
{0 CHEMBL1766932,1 1,2 1,3 1,4 1,5 1,6 1,7 1,8 1,9 1,10 1,11 1,12 1,13 1,14 1,15 1,16 1,17 1,18 1,19 1,20 1,21 1,22 1,23 1,24 1,25 1,26 1,27 1,28 1,29 1,30 1,31 1,32 1,33 1,34 1,35 1,36 1,37 1,38 1,39 1,40 1,41 1,42 1,43 1,44 1,51 1,52 6.051}
{0 CHEMBL1766933,1 1,2 1,3 1,4 1,5 1,6 1,7 1,8 1,9 1,10 1,11 1,12 1,13 1,14 1,15 1,16 1,17 1,18 1,19 1,20 1,21 1,22 1,23 1,24 1,25 1,26 1,27 1,28 1,29 1,30 1,31 1,32 1,33 1,34 1,35 1,36 1,37 1,38 1,39 1,40 1,41 1,42 1,43 1,44 1,51 1,52 4.886}
{0 CHEMBL1766934,1 1,2 1,3 1,4 1,5 1,6 1,7 1,8 1,9 1,10 1,11 1,12 1,13 1,14 1,15 1,16 1,17 1,18 1,19 1,20 1,21 1,22 1,23 1,24 1,25 1,26 1,27 1,28 1,29 1,30 1,31 1,32 1,33 1,34 1,35 1,36 1,37 1,38 1,39 1,40 1,41 1,42 1,43 1,44 1,51 1,52 5.886}
{0 CHEMBL1766935,1 1,2 1,3 1,4 1,5 1,6 1,7 1,8 1,9 1,10 1,11 1,12 1,13 1,14 1,15 1,16 1,17 1,18 1,19 1,20 1,21 1,22 1,23 1,24 1,25 1,26 1,27 1,28 1,29 1,30 1,31 1,32 1,33 1,34 1,35 1,36 1,37 1,38 1,39 1,40 1,41 1,42 1,43 1,44 1,51 1,52 9.638}
{0 CHEMBL1766936,1 1,2 1,3 1,4 1,5 1,6 1,7 1,8 1,9 1,10 1,11 1,12 1,13 1,14 1,15 1,17 1,18 1,19 1,20 1,21 1,22 1,23 1,24 1,25 1,26 1,27 1,28 1,29 1,30 1,31 1,32 1,33 1,34 1,35 1,36 1,37 1,39 1,40 1,41 1,42 1,43 1,44 1,51 1,52 8.469}
{0 CHEMBL1766937,1 1,2 1,3 1,4 1,5 1,6 1,7 1,8 1,9 1,10 1,11 1,12 1,13 1,15 1,16 1,17 1,18 1,19 1,20 1,21 1,22 1,23 1,24 1,25 1,26 1,27 1,28 1,29 1,30 1,31 1,32 1,33 1,34 1,35 1,36 1,37 1,38 1,39 1,40 1,41 1,42 1,43 1,44 1,51 1,52 8.076}
{0 CHEMBL1766938,1 1,2 1,3 1,4 1,5 1,6 1,7 1,8 1,9 1,10 1,11 1,12 1,13 1,14 1,15 1,16 1,17 1,18 1,19 1,20 1,21 1,22 1,23 1,24 1,25 1,26 1,28 1,29 1,30 1,31 1,32 1,33 1,34 1,35 1,36 1,37 1,38 1,39 1,40 1,41 1,42 1,43 1,44 1,51 1,52 6.602}
{0 CHEMBL1766939,1 1,2 1,3 1,4 1,5 1,6 1,7 1,8 1,9 1,10 1,13 1,14 1,15 1,16 1,17 1,18 1,19 1,20 1,21 1,22 1,23 1,24 1,25 1,26 1,27 1,28 1,29 1,30 1,31 1,32 1,33 1,34 1,35 1,36 1,37 1,38 1,39 1,40 1,41 1,42 1,43 1,44 1,51 1,52 8.076}
{0 CHEMBL1766940,1 1,2 1,3 1,4 1,6 1,7 1,8 1,9 1,10 1,13 1,14 1,15 1,16 1,18 1,21 1,22 1,23 1,24 1,25 1,26 1,28 1,29 1,30 1,31 1,33 1,34 1,36 1,37 1,38 1,39 1,40 1,41 1,42 1,43 1,44 1,46 1,48 1,51 1,52 5.432}
{0 CHEMBL1766941,2 1,5 1,6 1,7 1,8 1,9 1,10 1,11 1,12 1,13 1,15 1,16 1,17 1,18 1,19 1,20 1,21 1,22 1,23 1,24 1,25 1,26 1,27 1,31 1,32 1,34 1,35 1,36 1,37 1,38 1,39 1,40 1,41 1,42 1,43 1,44 1,51 1,52 4.328}
{0 CHEMBL1766942,2 1,5 1,6 1,7 1,8 1,9 1,10 1,11 1,12 1,13 1,15 1,16 1,17 1,18 1,19 1,20 1,21 1,22 1,23 1,24 1,25 1,26 1,27 1,31 1,32 1,34 1,35 1,36 1,37 1,38 1,39 1,40 1,41 1,42 1,43 1,44 1,45 1,51 1,52 5.585}
{0 CHEMBL1766943,2 1,5 1,6 1,7 1,8 1,9 1,10 1,11 1,12 1,13 1,15 1,16 1,17 1,18 1,19 1,20 1,21 1,22 1,23 1,24 1,25 1,26 1,27 1,31 1,32 1,35 1,36 1,37 1,38 1,39 1,40 1,41 1,42 1,43 1,44 1,45 1,51 1,52 5}
{0 CHEMBL1766944,2 1,5 1,6 1,7 1,8 1,9 1,10 1,11 1,12 1,13 1,15 1,16 1,17 1,18 1,19 1,20 1,21 1,22 1,23 1,24 1,25 1,26 1,27 1,28 1,29 1,30 1,31 1,32 1,33 1,34 1,35 1,36 1,37 1,38 1,39 1,40 1,41 1,42 1,43 1,44 1,46 1,51 1,52 4.097}
{0 CHEMBL1766945,2 1,5 1,6 1,7 1,8 1,9 1,10 1,11 1,12 1,13 1,15 1,16 1,17 1,18 1,19 1,20 1,21 1,22 1,23 1,24 1,25 1,26 1,27 1,28 1,29 1,30 1,31 1,32 1,33 1,34 1,35 1,36 1,37 1,38 1,39 1,40 1,41 1,42 1,43 1,44 1,46 1,51 1,52 5.081}
{0 CHEMBL1766946,2 1,5 1,6 1,7 1,8 1,9 1,10 1,11 1,12 1,13 1,15 1,16 1,17 1,18 1,21 1,22 1,23 1,24 1,25 1,26 1,27 1,28 1,29 1,30 1,31 1,33 1,34 1,36 1,37 1,38 1,39 1,40 1,41 1,42 1,43 1,44 1,46 1,51 1,52 4.495}
{0 CHEMBL1766947,1 1,2 1,3 1,4 1,5 1,6 1,7 1,8 1,9 1,10 1,11 1,12 1,13 1,15 1,16 1,17 1,18 1,19 1,20 1,21 1,22 1,23 1,24 1,25 1,26 1,31 1,32 1,35 1,36 1,37 1,38 1,41 1,42 1,43 1,44 1,45 1,51 1,52 5.071}
{0 CHEMBL1790849,1 1,2 1,3 1,4 1,5 1,6 1,7 1,8 1,9 1,10 1,11 1,12 1,13 1,14 1,15 1,16 1,17 1,18 1,19 1,20 1,21 1,22 1,23 1,24 1,25 1,26 1,27 1,28 1,29 1,30 1,31 1,32 1,33 1,34 1,35 1,36 1,37 1,38 1,39 1,40 1,41 1,42 1,43 1,44 1,46 1,51 1,52 7.991}
{0 CHEMBL1790850,1 1,2 1,3 1,4 1,5 1,6 1,7 1,8 1,9 1,10 1,11 1,12 1,13 1,14 1,15 1,16 1,17 1,18 1,19 1,20 1,21 1,22 1,23 1,24 1,25 1,26 1,27 1,28 1,29 1,30 1,31 1,32 1,33 1,34 1,35 1,36 1,37 1,38 1,39 1,40 1,41 1,42 1,43 1,44 1,46 1,51 1,52 9.301}
{0 CHEMBL1790851,1 1,2 1,3 1,4 1,5 1,6 1,7 1,8 1,9 1,10 1,11 1,12 1,13 1,14 1,15 1,16 1,17 1,18 1,21 1,22 1,23 1,24 1,25 1,26 1,27 1,28 1,29 1,30 1,31 1,33 1,34 1,36 1,37 1,38 1,39 1,40 1,41 1,42 1,43 1,44 1,46 1,51 1,52 7.656}
{0 CHEMBL1791383,1 1,2 1,3 1,4 1,5 1,6 1,7 1,8 1,9 1,10 1,11 1,12 1,13 1,14 1,15 1,16 1,17 1,18 1,19 1,20 1,21 1,22 1,23 1,24 1,25 1,26 1,27 1,28 1,29 1,30 1,31 1,32 1,33 1,34 1,35 1,36 1,37 1,38 1,39 1,40 1,41 1,42 1,43 1,44 1,46 1,51 1,52 9.566}
{0 CHEMBL1791384,1 1,2 1,3 1,4 1,5 1,6 1,7 1,8 1,9 1,10 1,11 1,12 1,13 1,14 1,15 1,16 1,17 1,18 1,19 1,20 1,21 1,22 1,23 1,24 1,25 1,26 1,27 1,28 1,29 1,30 1,31 1,32 1,33 1,34 1,35 1,36 1,37 1,38 1,39 1,40 1,41 1,42 1,43 1,44 1,46 1,51 1,52 9.675}
{0 CHEMBL186637,2 1,4 1,5 1,6 1,7 1,8 1,9 1,11 1,12 1,13 1,15 1,16 1,17 1,18 1,19 1,20 1,21 1,22 1,23 1,24 1,25 1,26 1,27 1,28 1,29 1,30 1,31 1,32 1,33 1,34 1,35 1,36 1,37 1,38 1,39 1,40 1,41 1,42 1,43 1,44 1,51 1,52 4}
{0 CHEMBL186638,2 1,4 1,5 1,6 1,7 1,8 1,9 1,11 1,12 1,13 1,15 1,16 1,17 1,18 1,19 1,20 1,21 1,22 1,23 1,24 1,25 1,26 1,27 1,28 1,29 1,30 1,31 1,32 1,33 1,34 1,35 1,36 1,37 1,38 1,39 1,40 1,41 1,42 1,43 1,44 1,51 1,52 4.854}
{0 CHEMBL1882689,33 1,34 1,36 1,37 1,41 1,45 1,51 1,52 4.91}
{0 CHEMBL1966869,10 1,11 1,13 1,18 1,22 1,26 1,31 1,36 1,37 1,41 1,42 1,43 1,44 1,46 1,48 1,51 1,52 5.146}
{0 CHEMBL1966872,42 1,45 1,52 4.955}
{0 CHEMBL1972217,24 1,30 1,33 1,41 1,45 1,51 1,52 4.714}
{0 CHEMBL1978125,24 1,28 1,29 1,30 1,33 1,41 1,45 1,51 1,52 4.767}
{0 CHEMBL1995726,11 1,51 1,52 5.07}
{0 CHEMBL1998816,11 1,24 1,28 1,30 1,33 1,41 1,51 1,52 4.754}
{0 CHEMBL2003819,11 1,24 1,28 1,29 1,30 1,33 1,51 1,52 5.179}
{0 CHEMBL2004070,12 1,15 1,26 1,37 1,43 1,45 1,51 1,52 4.398}
{0 CHEMBL219862,1 1,2 1,3 1,4 1,5 1,6 1,7 1,8 1,9 1,10 1,11 1,12 1,13 1,14 1,15 1,16 1,17 1,18 1,19 1,20 1,21 1,22 1,23 1,24 1,25 1,26 1,28 1,29 1,30 1,31 1,32 1,33 1,34 1,35 1,36 1,37 1,38 1,41 1,42 1,43 1,44 1,46 1,47 1,51 1,52 8.824}
{0 CHEMBL226876,6 1,26 1,31 1,37 1,41 1,43 1,46 1,48 1,50 1,51 1,52 4.747}
{0 CHEMBL2310906,2 1,4 1,5 1,6 1,7 1,8 1,9 1,10 1,11 1,12 1,13 1,15 1,16 1,17 1,18 1,19 1,20 1,21 1,22 1,23 1,24 1,25 1,26 1,27 1,28 1,29 1,30 1,31 1,32 1,33 1,34 1,35 1,36 1,37 1,38 1,39 1,40 1,41 1,42 1,43 1,44 1,51 1,52 5.573}
{0 CHEMBL253527,1 1,2 1,4 1,5 1,6 1,7 1,8 1,9 1,10 1,11 1,12 1,13 1,15 1,16 1,17 1,18 1,19 1,20 1,21 1,22 1,23 1,24 1,25 1,26 1,27 1,28 1,29 1,30 1,31 1,32 1,33 1,34 1,35 1,36 1,37 1,38 1,39 1,40 1,41 1,42 1,43 1,44 1,51 1,52 6.678}
{0 CHEMBL254769,1 1,2 1,3 1,4 1,5 1,6 1,7 1,8 1,9 1,10 1,11 1,12 1,13 1,14 1,15 1,16 1,17 1,18 1,21 1,22 1,23 1,24 1,25 1,26 1,27 1,28 1,29 1,30 1,31 1,33 1,34 1,36 1,37 1,38 1,39 1,40 1,41 1,42 1,43 1,44 1,46 1,51 1,52 8.796}
{0 CHEMBL254770,2 1,5 1,6 1,7 1,8 1,9 1,10 1,11 1,12 1,13 1,15 1,16 1,17 1,18 1,21 1,22 1,24 1,25 1,26 1,27 1,28 1,29 1,30 1,31 1,33 1,36 1,37 1,38 1,39 1,40 1,41 1,42 1,43 1,44 1,46 1,51 1,52 4.523}
{0 CHEMBL258221,1 1,2 1,3 1,4 1,5 1,6 1,7 1,8 1,9 1,10 1,11 1,12 1,13 1,14 1,15 1,16 1,17 1,18 1,21 1,22 1,23 1,24 1,25 1,26 1,27 1,28 1,29 1,30 1,31 1,33 1,34 1,36 1,37 1,38 1,39 1,40 1,41 1,42 1,43 1,44 1,46 1,51 1,52 8.569}
{0 CHEMBL266230,2 1,3 1,5 1,6 1,7 1,8 1,9 1,10 1,11 1,12 1,13 1,14 1,15 1,16 1,17 1,18 1,19 1,20 1,21 1,22 1,23 1,24 1,25 1,26 1,27 1,28 1,29 1,30 1,31 1,32 1,33 1,34 1,35 1,36 1,37 1,38 1,39 1,40 1,41 1,42 1,43 1,44 1,51 1,52 7.328}
{0 CHEMBL266571,1 1,2 1,3 1,4 1,5 1,6 1,7 1,8 1,9 1,10 1,11 1,12 1,13 1,14 1,15 1,16 1,17 1,18 1,19 1,20 1,21 1,22 1,23 1,24 1,25 1,26 1,31 1,32 1,35 1,36 1,37 1,38 1,41 1,42 1,43 1,44 1,45 1,46 1,47 1,51 1,52 6.699}
{0 CHEMBL270332,1 1,3 1,4 1,5 1,7 1,8 1,9 1,10 1,13 1,14 1,15 1,16 1,17 1,18 1,21 1,22 1,23 1,24 1,25 1,26 1,27 1,28 1,29 1,30 1,31 1,33 1,34 1,36 1,37 1,38 1,39 1,40 1,41 1,42 1,43 1,44 1,46 1,51 1,52 6.824}
{0 CHEMBL294989,2 1,5 1,6 1,11 1,12 1,15 1,17 1,24 1,26 1,37 1,41 1,43 1,44 1,45 1,51 1,52 6.666}
{0 CHEMBL335846,1 1,2 1,3 1,4 1,5 1,6 1,7 1,8 1,9 1,10 1,11 1,12 1,13 1,14 1,15 1,16 1,17 1,18 1,19 1,20 1,21 1,22 1,23 1,24 1,25 1,26 1,28 1,29 1,30 1,31 1,32 1,33 1,34 1,36 1,37 1,41 1,42 1,43 1,44 1,46 1,47 1,49 1,50 1,51 1,52 8.243}
{0 CHEMBL336836,1 1,2 1,3 1,4 1,5 1,6 1,7 1,8 1,9 1,10 1,11 1,12 1,13 1,14 1,15 1,16 1,17 1,18 1,19 1,21 1,22 1,23 1,24 1,25 1,26 1,27 1,28 1,29 1,30 1,31 1,32 1,33 1,34 1,36 1,37 1,39 1,40 1,41 1,42 1,43 1,44 1,46 1,49 1,50 1,51 1,52 9.602}
{0 CHEMBL337260,1 1,2 1,3 1,4 1,5 1,6 1,7 1,8 1,9 1,10 1,11 1,12 1,13 1,14 1,15 1,16 1,17 1,18 1,19 1,20 1,21 1,22 1,23 1,24 1,25 1,26 1,27 1,28 1,29 1,30 1,31 1,32 1,33 1,34 1,36 1,37 1,39 1,40 1,41 1,42 1,43 1,44 1,46 1,49 1,50 1,51 1,52 9.469}
{0 CHEMBL337644,1 1,2 1,3 1,4 1,5 1,6 1,7 1,8 1,9 1,10 1,11 1,12 1,13 1,14 1,15 1,16 1,17 1,18 1,19 1,20 1,21 1,22 1,23 1,24 1,25 1,26 1,27 1,28 1,29 1,30 1,31 1,32 1,33 1,34 1,36 1,37 1,39 1,40 1,41 1,42 1,43 1,44 1,46 1,49 1,50 1,51 1,52 9.42}
{0 CHEMBL337721,1 1,2 1,3 1,4 1,5 1,6 1,7 1,8 1,9 1,10 1,11 1,12 1,13 1,14 1,15 1,16 1,17 1,18 1,19 1,20 1,21 1,22 1,23 1,24 1,25 1,26 1,27 1,28 1,29 1,30 1,31 1,32 1,33 1,34 1,36 1,37 1,39 1,40 1,41 1,42 1,43 1,44 1,49 1,50 1,51 1,52 8.921}
{0 CHEMBL339139,1 1,2 1,3 1,4 1,5 1,6 1,7 1,8 1,9 1,10 1,11 1,12 1,13 1,14 1,15 1,16 1,17 1,18 1,19 1,20 1,21 1,22 1,23 1,24 1,25 1,26 1,27 1,28 1,29 1,30 1,31 1,32 1,33 1,34 1,36 1,37 1,39 1,40 1,41 1,42 1,43 1,44 1,46 1,49 1,50 1,51 1,52 9.229}
{0 CHEMBL342252,1 1,2 1,3 1,4 1,5 1,6 1,7 1,8 1,9 1,10 1,11 1,12 1,13 1,14 1,15 1,16 1,17 1,18 1,19 1,20 1,21 1,22 1,23 1,24 1,25 1,26 1,27 1,28 1,29 1,30 1,31 1,32 1,33 1,34 1,35 1,36 1,37 1,38 1,39 1,40 1,41 1,42 1,43 1,44 1,51 1,52 9.523}
{0 CHEMBL343970,1 1,2 1,3 1,4 1,5 1,6 1,7 1,8 1,9 1,10 1,11 1,12 1,14 1,15 1,17 1,18 1,21 1,22 1,23 1,24 1,25 1,26 1,27 1,28 1,29 1,30 1,31 1,33 1,34 1,36 1,37 1,39 1,40 1,41 1,42 1,43 1,44 1,46 1,51 1,52 7.833}
{0 CHEMBL344020,1 1,2 1,3 1,4 1,5 1,6 1,7 1,8 1,9 1,10 1,11 1,12 1,14 1,15 1,17 1,18 1,21 1,22 1,23 1,24 1,25 1,26 1,27 1,28 1,29 1,30 1,31 1,33 1,34 1,36 1,37 1,39 1,40 1,41 1,42 1,43 1,44 1,46 1,51 1,52 8.032}
{0 CHEMBL344337,1 1,2 1,3 1,4 1,5 1,6 1,7 1,8 1,9 1,10 1,11 1,12 1,13 1,14 1,15 1,16 1,17 1,18 1,19 1,20 1,21 1,22 1,23 1,24 1,25 1,26 1,27 1,28 1,29 1,30 1,31 1,32 1,33 1,34 1,35 1,36 1,37 1,38 1,39 1,40 1,41 1,42 1,43 1,44 1,51 1,52 8.724}
{0 CHEMBL362127,2 1,4 1,5 1,6 1,7 1,8 1,9 1,11 1,12 1,13 1,15 1,16 1,17 1,18 1,19 1,20 1,21 1,22 1,23 1,24 1,25 1,26 1,27 1,28 1,29 1,30 1,31 1,32 1,33 1,34 1,35 1,36 1,37 1,38 1,39 1,40 1,41 1,42 1,43 1,44 1,51 1,52 7.921}
{0 CHEMBL375002,1 1,2 1,3 1,4 1,5 1,6 1,7 1,8 1,9 1,10 1,11 1,12 1,13 1,14 1,15 1,16 1,17 1,18 1,19 1,20 1,21 1,22 1,23 1,24 1,25 1,26 1,28 1,29 1,30 1,31 1,32 1,33 1,34 1,35 1,36 1,37 1,38 1,41 1,42 1,43 1,44 1,46 1,47 1,51 1,52 9.182}
{0 CHEMBL386387,1 1,2 1,3 1,4 1,5 1,6 1,7 1,8 1,9 1,10 1,11 1,12 1,13 1,14 1,15 1,16 1,18 1,19 1,20 1,21 1,22 1,23 1,24 1,25 1,26 1,27 1,28 1,29 1,30 1,31 1,32 1,33 1,34 1,35 1,36 1,37 1,38 1,41 1,42 1,43 1,44 1,46 1,47 1,51 1,52 9.222}
{0 CHEMBL404942,1 1,2 1,3 1,4 1,6 1,7 1,8 1,9 1,10 1,11 1,12 1,13 1,14 1,15 1,16 1,18 1,19 1,20 1,21 1,22 1,23 1,24 1,25 1,26 1,27 1,28 1,29 1,30 1,31 1,32 1,33 1,34 1,35 1,36 1,37 1,38 1,41 1,42 1,43 1,44 1,46 1,47 1,51 1,52 9.398}
{0 CHEMBL405160,1 1,2 1,3 1,4 1,5 1,6 1,7 1,8 1,9 1,10 1,11 1,12 1,13 1,14 1,15 1,16 1,17 1,18 1,19 1,20 1,21 1,22 1,23 1,24 1,25 1,26 1,27 1,28 1,29 1,30 1,31 1,32 1,33 1,34 1,35 1,36 1,37 1,38 1,41 1,42 1,43 1,44 1,46 1,47 1,51 1,52 7.939}
{0 CHEMBL405584,1 1,2 1,3 1,4 1,5 1,6 1,7 1,8 1,9 1,10 1,11 1,12 1,13 1,14 1,15 1,16 1,17 1,18 1,19 1,20 1,21 1,22 1,23 1,24 1,25 1,26 1,27 1,28 1,29 1,30 1,31 1,32 1,33 1,34 1,35 1,36 1,37 1,38 1,39 1,40 1,41 1,42 1,43 1,44 1,46 1,51 1,52 8.816}
{0 CHEMBL405804,1 1,2 1,3 1,4 1,6 1,7 1,8 1,9 1,10 1,11 1,13 1,14 1,15 1,16 1,18 1,19 1,20 1,21 1,22 1,23 1,24 1,25 1,26 1,27 1,28 1,29 1,30 1,31 1,32 1,33 1,34 1,35 1,36 1,37 1,38 1,41 1,42 1,43 1,44 1,46 1,47 1,51 1,52 7.664}
{0 CHEMBL406127,1 1,2 1,3 1,4 1,5 1,6 1,7 1,8 1,9 1,10 1,11 1,12 1,13 1,14 1,15 1,16 1,17 1,18 1,19 1,20 1,21 1,22 1,23 1,24 1,25 1,26 1,27 1,28 1,29 1,30 1,31 1,32 1,33 1,34 1,35 1,36 1,37 1,38 1,41 1,42 1,43 1,44 1,46 1,47 1,51 1,52 9.398}
{0 CHEMBL406456,1 1,2 1,3 1,4 1,5 1,6 1,7 1,8 1,9 1,10 1,11 1,12 1,13 1,14 1,15 1,16 1,17 1,18 1,19 1,20 1,21 1,22 1,23 1,24 1,25 1,26 1,27 1,28 1,29 1,30 1,31 1,32 1,33 1,34 1,35 1,36 1,37 1,38 1,39 1,40 1,41 1,42 1,43 1,44 1,46 1,50 1,51 1,52 9.222}
{0 CHEMBL407187,1 1,2 1,3 1,4 1,5 1,6 1,7 1,8 1,9 1,10 1,11 1,12 1,13 1,14 1,15 1,16 1,18 1,19 1,20 1,21 1,22 1,23 1,24 1,25 1,26 1,27 1,28 1,29 1,30 1,31 1,32 1,33 1,34 1,35 1,36 1,37 1,38 1,41 1,42 1,43 1,44 1,46 1,47 1,51 1,52 7.926}
{0 CHEMBL407196,1 1,2 1,3 1,4 1,5 1,6 1,7 1,8 1,9 1,10 1,11 1,12 1,13 1,14 1,15 1,16 1,17 1,18 1,19 1,20 1,21 1,22 1,23 1,24 1,25 1,26 1,27 1,28 1,29 1,30 1,31 1,32 1,33 1,34 1,35 1,36 1,37 1,38 1,39 1,40 1,41 1,42 1,43 1,44 1,46 1,51 1,52 8.724}
{0 CHEMBL407329,1 1,2 1,3 1,4 1,5 1,6 1,7 1,8 1,9 1,10 1,11 1,12 1,13 1,14 1,15 1,16 1,17 1,18 1,21 1,22 1,23 1,24 1,25 1,26 1,27 1,28 1,29 1,30 1,31 1,33 1,34 1,36 1,37 1,38 1,41 1,42 1,43 1,44 1,46 1,47 1,51 1,52 7.225}
{0 CHEMBL408127,1 1,2 1,3 1,4 1,5 1,6 1,7 1,8 1,9 1,10 1,11 1,12 1,13 1,14 1,15 1,16 1,17 1,18 1,19 1,20 1,21 1,22 1,23 1,24 1,25 1,26 1,27 1,28 1,29 1,30 1,31 1,32 1,33 1,34 1,35 1,36 1,37 1,38 1,41 1,42 1,43 1,44 1,46 1,47 1,51 1,52 9.523}
{0 CHEMBL408381,1 1,2 1,3 1,4 1,5 1,6 1,7 1,8 1,9 1,10 1,11 1,12 1,13 1,14 1,15 1,16 1,17 1,18 1,19 1,20 1,21 1,22 1,23 1,24 1,25 1,26 1,27 1,28 1,29 1,30 1,31 1,32 1,33 1,34 1,35 1,36 1,37 1,38 1,41 1,42 1,43 1,44 1,46 1,47 1,51 1,52 9.523}
{0 CHEMBL408387,1 1,2 1,3 1,4 1,5 1,6 1,7 1,8 1,9 1,10 1,11 1,12 1,13 1,14 1,15 1,16 1,17 1,18 1,19 1,20 1,21 1,22 1,23 1,24 1,25 1,26 1,28 1,29 1,30 1,31 1,32 1,33 1,34 1,35 1,36 1,37 1,38 1,41 1,42 1,43 1,44 1,46 1,47 1,51 1,52 7.609}
{0 CHEMBL408534,1 1,2 1,3 1,4 1,5 1,6 1,7 1,8 1,9 1,10 1,11 1,12 1,13 1,14 1,15 1,16 1,17 1,18 1,19 1,20 1,21 1,22 1,23 1,24 1,25 1,26 1,27 1,28 1,29 1,30 1,31 1,32 1,33 1,34 1,35 1,36 1,37 1,38 1,39 1,40 1,41 1,42 1,43 1,44 1,46 1,51 1,52 8.921}
{0 CHEMBL408638,1 1,2 1,3 1,4 1,5 1,6 1,7 1,8 1,9 1,10 1,11 1,12 1,13 1,14 1,15 1,16 1,17 1,18 1,19 1,20 1,21 1,22 1,23 1,24 1,25 1,26 1,27 1,28 1,29 1,30 1,31 1,32 1,33 1,34 1,35 1,36 1,37 1,38 1,41 1,42 1,43 1,44 1,46 1,47 1,51 1,52 9.222}
{0 CHEMBL408997,1 1,2 1,3 1,4 1,5 1,6 1,7 1,8 1,9 1,10 1,11 1,12 1,13 1,14 1,15 1,16 1,17 1,18 1,19 1,20 1,21 1,22 1,23 1,24 1,25 1,26 1,27 1,28 1,29 1,30 1,31 1,32 1,33 1,34 1,35 1,36 1,37 1,38 1,41 1,42 1,43 1,44 1,45 1,46 1,47 1,51 1,52 6.975}
{0 CHEMBL409477,1 1,2 1,3 1,4 1,5 1,6 1,7 1,8 1,9 1,10 1,11 1,12 1,13 1,14 1,15 1,16 1,17 1,18 1,19 1,20 1,21 1,22 1,23 1,24 1,25 1,26 1,27 1,28 1,29 1,30 1,31 1,32 1,33 1,34 1,35 1,36 1,37 1,38 1,39 1,40 1,41 1,42 1,43 1,44 1,51 1,52 9.398}
{0 CHEMBL410289,1 1,2 1,3 1,4 1,5 1,6 1,7 1,8 1,9 1,10 1,11 1,12 1,13 1,14 1,15 1,16 1,17 1,18 1,19 1,20 1,21 1,22 1,23 1,24 1,25 1,26 1,27 1,28 1,29 1,30 1,31 1,32 1,33 1,34 1,35 1,36 1,37 1,38 1,41 1,42 1,43 1,44 1,46 1,47 1,51 1,52 6.947}
{0 CHEMBL411195,1 1,2 1,3 1,4 1,5 1,6 1,7 1,8 1,9 1,10 1,11 1,12 1,13 1,14 1,15 1,16 1,17 1,18 1,21 1,22 1,23 1,24 1,25 1,26 1,27 1,28 1,29 1,30 1,31 1,33 1,34 1,36 1,37 1,39 1,40 1,41 1,42 1,43 1,44 1,46 1,50 1,51 1,52 7.77}
{0 CHEMBL412699,1 1,2 1,3 1,4 1,5 1,6 1,7 1,8 1,9 1,10 1,11 1,12 1,13 1,14 1,15 1,16 1,17 1,18 1,19 1,20 1,21 1,22 1,23 1,24 1,25 1,26 1,27 1,28 1,29 1,30 1,31 1,32 1,33 1,34 1,35 1,36 1,37 1,38 1,39 1,40 1,41 1,42 1,43 1,44 1,46 1,51 1,52 9.398}
{0 CHEMBL413010,1 1,2 1,3 1,4 1,5 1,6 1,7 1,8 1,9 1,10 1,11 1,12 1,13 1,14 1,15 1,16 1,18 1,19 1,20 1,21 1,22 1,23 1,24 1,25 1,26 1,27 1,28 1,29 1,30 1,31 1,32 1,33 1,34 1,35 1,36 1,37 1,38 1,41 1,42 1,43 1,44 1,46 1,47 1,51 1,52 7.373}
{0 CHEMBL413192,1 1,2 1,3 1,4 1,5 1,6 1,7 1,8 1,9 1,10 1,11 1,12 1,13 1,14 1,15 1,16 1,17 1,18 1,19 1,20 1,21 1,22 1,23 1,24 1,25 1,26 1,28 1,29 1,30 1,31 1,32 1,33 1,34 1,35 1,36 1,37 1,38 1,41 1,42 1,43 1,44 1,46 1,47 1,51 1,52 8.201}
{0 CHEMBL424896,1 1,2 1,3 1,4 1,5 1,6 1,7 1,8 1,9 1,10 1,11 1,12 1,13 1,14 1,15 1,16 1,17 1,18 1,19 1,20 1,21 1,22 1,23 1,24 1,25 1,26 1,28 1,29 1,30 1,31 1,32 1,33 1,34 1,35 1,36 1,37 1,38 1,41 1,42 1,43 1,44 1,46 1,47 1,51 1,52 8.602}
{0 CHEMBL430910,1 1,2 1,3 1,4 1,5 1,6 1,7 1,8 1,9 1,10 1,11 1,12 1,13 1,14 1,15 1,16 1,17 1,18 1,19 1,20 1,21 1,22 1,23 1,24 1,25 1,26 1,27 1,28 1,29 1,30 1,31 1,32 1,33 1,34 1,36 1,37 1,39 1,40 1,41 1,42 1,43 1,44 1,46 1,49 1,50 1,51 1,52 9.523}
{0 CHEMBL434134,2 1,4 1,5 1,6 1,7 1,8 1,9 1,11 1,12 1,13 1,15 1,16 1,17 1,18 1,19 1,20 1,21 1,22 1,23 1,24 1,25 1,26 1,27 1,28 1,29 1,30 1,31 1,32 1,33 1,34 1,35 1,36 1,37 1,38 1,39 1,40 1,41 1,42 1,43 1,44 1,51 1,52 4.77}
{0 CHEMBL434227,1 1,2 1,3 1,4 1,5 1,6 1,7 1,8 1,9 1,10 1,11 1,12 1,13 1,14 1,15 1,16 1,17 1,18 1,19 1,20 1,21 1,22 1,23 1,24 1,25 1,26 1,27 1,28 1,29 1,30 1,31 1,32 1,33 1,34 1,36 1,37 1,39 1,40 1,41 1,42 1,43 1,44 1,49 1,50 1,51 1,52 9.523}
{0 CHEMBL435199,1 1,2 1,3 1,4 1,5 1,6 1,7 1,8 1,9 1,10 1,11 1,12 1,13 1,14 1,15 1,16 1,17 1,18 1,19 1,20 1,21 1,22 1,23 1,24 1,25 1,26 1,31 1,32 1,36 1,37 1,41 1,42 1,43 1,44 1,45 1,46 1,47 1,49 1,50 1,51 1,52 6.876}
{0 CHEMBL436717,1 1,2 1,3 1,4 1,5 1,6 1,7 1,8 1,9 1,10 1,11 1,12 1,13 1,14 1,15 1,16 1,17 1,18 1,19 1,20 1,21 1,22 1,23 1,24 1,25 1,26 1,27 1,28 1,29 1,30 1,31 1,32 1,33 1,34 1,35 1,36 1,37 1,38 1,41 1,42 1,43 1,44 1,47 1,51 1,52 6}
{0 CHEMBL437288,1 1,2 1,3 1,4 1,5 1,6 1,7 1,8 1,9 1,10 1,11 1,12 1,13 1,14 1,15 1,16 1,17 1,18 1,19 1,20 1,21 1,22 1,23 1,24 1,25 1,26 1,27 1,28 1,29 1,30 1,31 1,32 1,33 1,34 1,35 1,36 1,37 1,38 1,41 1,42 1,43 1,44 1,46 1,47 1,51 1,52 9.301}
{0 CHEMBL437707,1 1,2 1,3 1,4 1,5 1,6 1,7 1,8 1,9 1,10 1,11 1,12 1,13 1,14 1,15 1,16 1,17 1,18 1,19 1,20 1,21 1,22 1,23 1,24 1,25 1,26 1,27 1,28 1,29 1,30 1,31 1,32 1,33 1,34 1,35 1,36 1,37 1,38 1,41 1,42 1,43 1,44 1,46 1,47 1,51 1,52 8.824}
{0 CHEMBL439494,1 1,2 1,3 1,4 1,5 1,6 1,7 1,8 1,9 1,10 1,11 1,13 1,14 1,15 1,16 1,17 1,18 1,19 1,20 1,21 1,22 1,23 1,24 1,25 1,26 1,28 1,29 1,30 1,31 1,32 1,33 1,34 1,35 1,36 1,37 1,38 1,39 1,40 1,41 1,42 1,43 1,44 1,46 1,51 1,52 9.398}
{0 CHEMBL439694,1 1,2 1,3 1,4 1,5 1,6 1,7 1,8 1,9 1,10 1,11 1,12 1,13 1,14 1,15 1,16 1,17 1,18 1,19 1,20 1,21 1,22 1,23 1,24 1,25 1,26 1,27 1,28 1,29 1,30 1,31 1,32 1,33 1,34 1,35 1,36 1,37 1,38 1,39 1,40 1,41 1,42 1,43 1,44 1,46 1,51 1,52 8.469}
{0 CHEMBL443967,1 1,2 1,3 1,4 1,5 1,6 1,7 1,8 1,9 1,10 1,11 1,12 1,13 1,14 1,15 1,16 1,17 1,18 1,19 1,20 1,21 1,22 1,23 1,24 1,25 1,26 1,27 1,28 1,29 1,30 1,31 1,32 1,33 1,34 1,35 1,36 1,37 1,39 1,40 1,41 1,42 1,43 1,44 1,50 1,51 1,52 9.292}
{0 CHEMBL445035,1 1,2 1,3 1,4 1,5 1,6 1,7 1,8 1,9 1,10 1,11 1,12 1,13 1,14 1,15 1,16 1,17 1,18 1,19 1,20 1,21 1,22 1,23 1,24 1,25 1,26 1,31 1,32 1,35 1,36 1,37 1,38 1,41 1,42 1,43 1,44 1,45 1,46 1,47 1,51 1,52 6.519}
{0 CHEMBL447400,1 1,2 1,3 1,4 1,5 1,6 1,7 1,8 1,9 1,10 1,11 1,12 1,13 1,14 1,15 1,16 1,17 1,18 1,19 1,20 1,21 1,22 1,23 1,24 1,25 1,26 1,28 1,29 1,30 1,31 1,32 1,33 1,34 1,35 1,36 1,37 1,38 1,41 1,42 1,43 1,44 1,46 1,47 1,51 1,52 7.631}
{0 CHEMBL450258,1 1,2 1,3 1,4 1,5 1,6 1,7 1,8 1,9 1,10 1,11 1,12 1,13 1,14 1,15 1,16 1,17 1,18 1,19 1,20 1,21 1,22 1,23 1,24 1,25 1,26 1,28 1,29 1,30 1,31 1,32 1,33 1,34 1,35 1,36 1,37 1,38 1,41 1,42 1,43 1,44 1,46 1,47 1,51 1,52 8.462}
{0 CHEMBL450740,1 1,2 1,3 1,4 1,5 1,6 1,7 1,8 1,9 1,10 1,11 1,12 1,13 1,14 1,15 1,16 1,17 1,18 1,21 1,22 1,23 1,24 1,25 1,26 1,27 1,28 1,29 1,30 1,31 1,33 1,34 1,36 1,37 1,38 1,39 1,40 1,41 1,42 1,43 1,44 1,46 1,51 1,52 8.854}
{0 CHEMBL453924,1 1,2 1,3 1,4 1,5 1,6 1,7 1,8 1,9 1,10 1,11 1,12 1,13 1,14 1,15 1,16 1,17 1,18 1,19 1,20 1,21 1,22 1,23 1,24 1,25 1,26 1,28 1,29 1,30 1,31 1,32 1,33 1,34 1,35 1,36 1,37 1,38 1,41 1,42 1,43 1,44 1,46 1,47 1,51 1,52 8.199}
{0 CHEMBL462830,2 1,5 1,6 1,11 1,12 1,15 1,17 1,24 1,26 1,37 1,41 1,43 1,45 1,51 1,52 6.658}
{0 CHEMBL463227,2 1,5 1,6 1,11 1,12 1,15 1,17 1,24 1,26 1,37 1,41 1,43 1,45 1,51 1,52 6.006}
{0 CHEMBL463811,2 1,5 1,6 1,8 1,11 1,12 1,13 1,15 1,17 1,24 1,26 1,36 1,37 1,41 1,43 1,45 1,51 1,52 6.75}
{0 CHEMBL464011,2 1,5 1,6 1,11 1,12 1,15 1,17 1,24 1,26 1,37 1,41 1,43 1,45 1,51 1,52 5.69}
{0 CHEMBL468951,1 1,2 1,3 1,4 1,5 1,6 1,7 1,8 1,9 1,10 1,11 1,12 1,13 1,14 1,15 1,16 1,17 1,18 1,19 1,20 1,21 1,22 1,23 1,24 1,25 1,26 1,27 1,28 1,29 1,30 1,31 1,32 1,33 1,34 1,35 1,36 1,37 1,38 1,39 1,40 1,41 1,42 1,43 1,44 1,51 1,52 9.417}
{0 CHEMBL48981,1 1,2 1,3 1,4 1,5 1,6 1,7 1,8 1,9 1,10 1,11 1,12 1,13 1,14 1,15 1,16 1,17 1,18 1,19 1,20 1,21 1,22 1,23 1,24 1,25 1,26 1,27 1,28 1,29 1,30 1,31 1,32 1,33 1,34 1,35 1,36 1,37 1,39 1,40 1,41 1,42 1,43 1,44 1,50 1,51 1,52 7.721}
{0 CHEMBL493863,15 1,43 1,45 1,51 1,52 4.914}
{0 CHEMBL496585,2 1,5 1,6 1,8 1,11 1,12 1,13 1,15 1,17 1,24 1,26 1,36 1,37 1,41 1,43 1,45 1,51 1,52 6.264}
{0 CHEMBL499673,1 1,2 1,3 1,4 1,5 1,6 1,7 1,8 1,9 1,10 1,11 1,12 1,13 1,14 1,15 1,16 1,17 1,18 1,19 1,20 1,21 1,22 1,23 1,24 1,25 1,26 1,28 1,29 1,30 1,31 1,32 1,33 1,34 1,35 1,36 1,37 1,38 1,41 1,42 1,43 1,44 1,46 1,47 1,51 1,52 7.92}
{0 CHEMBL500173,1 1,2 1,3 1,4 1,5 1,6 1,7 1,8 1,9 1,10 1,11 1,12 1,13 1,14 1,15 1,16 1,17 1,18 1,19 1,20 1,21 1,22 1,23 1,24 1,25 1,26 1,31 1,32 1,35 1,36 1,37 1,38 1,41 1,42 1,43 1,44 1,45 1,46 1,47 1,51 1,52 6.106}
{0 CHEMBL500734,1 1,2 1,3 1,4 1,5 1,6 1,7 1,8 1,9 1,10 1,11 1,12 1,13 1,14 1,15 1,16 1,17 1,18 1,19 1,20 1,21 1,22 1,23 1,24 1,25 1,26 1,31 1,32 1,35 1,36 1,37 1,38 1,41 1,42 1,43 1,44 1,45 1,46 1,47 1,51 1,52 6.117}
{0 CHEMBL501575,1 1,2 1,3 1,4 1,5 1,6 1,7 1,8 1,9 1,10 1,11 1,12 1,13 1,14 1,15 1,16 1,17 1,18 1,19 1,20 1,21 1,22 1,23 1,24 1,25 1,26 1,27 1,28 1,29 1,30 1,31 1,32 1,33 1,34 1,35 1,36 1,37 1,38 1,39 1,40 1,41 1,42 1,43 1,44 1,51 1,52 8.187}
{0 CHEMBL501956,1 1,2 1,3 1,4 1,5 1,6 1,7 1,8 1,9 1,10 1,11 1,12 1,13 1,14 1,15 1,16 1,17 1,18 1,19 1,20 1,21 1,22 1,23 1,24 1,25 1,26 1,31 1,32 1,35 1,36 1,37 1,38 1,41 1,42 1,43 1,44 1,45 1,46 1,47 1,51 1,52 5.664}
{0 CHEMBL503059,1 1,2 1,3 1,4 1,5 1,6 1,7 1,8 1,9 1,10 1,11 1,12 1,13 1,15 1,16 1,17 1,18 1,19 1,20 1,21 1,22 1,23 1,24 1,25 1,26 1,28 1,29 1,30 1,31 1,32 1,33 1,34 1,35 1,36 1,37 1,38 1,40 1,41 1,42 1,43 1,44 1,51 1,52 6.796}
{0 CHEMBL504768,1 1,2 1,3 1,4 1,5 1,6 1,7 1,8 1,9 1,10 1,11 1,12 1,13 1,14 1,15 1,16 1,17 1,18 1,19 1,20 1,21 1,22 1,23 1,24 1,25 1,26 1,27 1,28 1,29 1,30 1,31 1,32 1,33 1,34 1,35 1,36 1,37 1,38 1,39 1,40 1,41 1,42 1,43 1,44 1,51 1,52 9.108}
{0 CHEMBL505695,1 1,2 1,3 1,4 1,5 1,6 1,7 1,8 1,9 1,10 1,11 1,12 1,13 1,14 1,15 1,16 1,17 1,18 1,19 1,20 1,21 1,22 1,23 1,24 1,25 1,26 1,27 1,28 1,29 1,30 1,31 1,32 1,33 1,34 1,35 1,36 1,37 1,38 1,39 1,40 1,41 1,42 1,43 1,44 1,51 1,52 8.697}
{0 CHEMBL505906,1 1,2 1,3 1,4 1,5 1,6 1,7 1,8 1,9 1,10 1,11 1,12 1,13 1,14 1,15 1,16 1,17 1,18 1,19 1,20 1,21 1,22 1,23 1,24 1,25 1,26 1,28 1,29 1,30 1,31 1,32 1,33 1,34 1,35 1,36 1,37 1,38 1,41 1,42 1,43 1,44 1,46 1,47 1,51 1,52 8.15}
{0 CHEMBL506981,2 1,6 1,24 1,26 1,37 1,41 1,45 1,51 1,52 8.126}
{0 CHEMBL507382,1 1,2 1,3 1,4 1,6 1,7 1,8 1,9 1,10 1,13 1,14 1,15 1,16 1,18 1,19 1,20 1,21 1,22 1,23 1,24 1,25 1,26 1,27 1,28 1,29 1,30 1,31 1,32 1,33 1,34 1,35 1,36 1,37 1,38 1,39 1,40 1,41 1,42 1,43 1,44 1,51 1,52 8.62}
{0 CHEMBL508044,2 1,5 1,6 1,11 1,12 1,15 1,17 1,24 1,26 1,37 1,41 1,43 1,45 1,51 1,52 7.174}
{0 CHEMBL508130,1 1,2 1,3 1,4 1,6 1,7 1,8 1,9 1,10 1,13 1,14 1,15 1,16 1,17 1,18 1,19 1,20 1,21 1,22 1,23 1,24 1,25 1,26 1,28 1,29 1,30 1,31 1,32 1,33 1,34 1,35 1,36 1,37 1,38 1,39 1,40 1,41 1,42 1,43 1,44 1,51 1,52 6.721}
{0 CHEMBL508380,1 1,2 1,3 1,4 1,5 1,6 1,7 1,8 1,9 1,10 1,11 1,12 1,13 1,14 1,15 1,16 1,17 1,18 1,19 1,20 1,21 1,22 1,23 1,24 1,25 1,26 1,31 1,32 1,35 1,36 1,37 1,38 1,41 1,42 1,43 1,44 1,45 1,46 1,47 1,51 1,52 6.854}
{0 CHEMBL508507,1 1,2 1,3 1,4 1,5 1,6 1,7 1,8 1,9 1,10 1,11 1,12 1,13 1,14 1,15 1,16 1,17 1,18 1,19 1,20 1,21 1,22 1,23 1,24 1,25 1,26 1,28 1,29 1,30 1,31 1,32 1,33 1,34 1,35 1,36 1,37 1,38 1,41 1,42 1,43 1,44 1,46 1,47 1,51 1,52 6.804}
{0 CHEMBL508567,1 1,2 1,3 1,4 1,5 1,6 1,7 1,8 1,9 1,10 1,11 1,12 1,13 1,14 1,15 1,16 1,17 1,18 1,19 1,20 1,21 1,22 1,23 1,24 1,25 1,26 1,31 1,32 1,35 1,36 1,37 1,38 1,41 1,42 1,43 1,44 1,45 1,46 1,47 1,51 1,52 8.81}
{0 CHEMBL518675,2 1,5 1,6 1,11 1,12 1,15 1,17 1,24 1,26 1,37 1,41 1,43 1,45 1,51 1,52 5.916}
{0 CHEMBL532160,31 1,41 1,51 1,52 5.272}
{0 CHEMBL548458,24 1,28 1,29 1,30 1,33 1,45 1,52 4.712}
{0 CHEMBL584444,18 1,19 1,26 1,31 1,32 1,33 1,34 1,37 1,41 1,43 1,44 1,46 1,51 1,52 4.724}
