"molecule_id","N.","nN","pXC50"
{3 7.523}
{0 CHEMBL116438,3 7.523}
{0 CHEMBL1564869,1 5.1,2 2,3 6.638}
{0 CHEMBL1699292,1 13,2 3,3 4.155}
{0 CHEMBL179512,3 7.523}
{0 CHEMBL2063044,1 9.4,2 3,3 4.301}
{0 CHEMBL2063046,1 12,2 3,3 4.081}
{0 CHEMBL2063048,1 16.7,2 4,3 5.564}
{0 CHEMBL2063050,1 11.5,2 3,3 4.824}
{0 CHEMBL2063052,1 11.5,2 3,3 5}
{0 CHEMBL2063053,1 10.3,2 3,3 4.585}
{0 CHEMBL2063056,1 8.6,2 3,3 4.638}
{0 CHEMBL2063057,1 9.1,2 3,3 4.481}
{0 CHEMBL2063058,1 10.7,2 3,3 4.456}
{0 CHEMBL2063059,1 14.8,2 4,3 4.699}
{0 CHEMBL2063060,1 10.3,2 3,3 5.444}
{0 CHEMBL297453,3 7.553}
{0 CHEMBL382617,1 15.8,2 6,3 6.398}
{0 CHEMBL383475,1 5.1,2 2,3 6.222}
