{
  "data_set_description": {
    "collection_date": "November 2013",
    "creator": "Dr Jeremy Besnard, Dr Ivan Olier, Dr Noureddin Sadawi, Dr Larisa Soldatova, Dr Crina Grosan, Prof Ross King, Dr Richard Bickerton, Prof Andrew Hopkins and Dr Willem van Hoorn",
    "default_target_attribute": "pXC50",
    "description": "This dataset contains QSAR data (from ChEMBL version 17) showing activity values (unit is pseudo-pCI50) of several compounds on drug target ChEMBL_ID: CHEMBL1809 (TID: 7), and it has 54 rows and 1183 features (not including molecule IDs and class feature: molecule_id and pXC50). The features represent Molecular Descriptors which were generated from SMILES strings. Missing value imputation was applied to this dataset (By choosing the Median).",
    "description_version": "1",
    "file_id": "3412307",
    "format": "ARFF",
    "id": "30165",
    "licence": "Public",
    "md5_checksum": "96621aedff1c5ed687c62ea1883b7c09",
    "minio_url": "https://data.openml.org/datasets/0003/30165/dataset_30165.pq",
    "name": "QSAR-DATASET-FOR-DRUG-TARGET-CHEMBL1809",
    "original_data_url": "https://www.ebi.ac.uk/chembl/target/inspect/CHEMBL1809",
    "parquet_url": "https://data.openml.org/datasets/0003/30165/dataset_30165.pq",
    "processing_date": "2018-10-04 01:42:08",
    "row_id_attribute": "molecule_id",
    "status": "deactivated",
    "tag": [
      "MetaQSAR",
      "study_13"
    ],
    "upload_date": "2016-07-15T04:19:02",
    "url": "https://api.openml.org/data/v1/download/3412307/QSAR-DATASET-FOR-DRUG-TARGET-CHEMBL1809.arff",
    "version": "9",
    "visibility": "public"
  }
}