"molecule_id","FCFP4_1024b1","FCFP4_1024b10","FCFP4_1024b100","FCFP4_1024b1000","FCFP4_1024b1001","FCFP4_1024b1002","FCFP4_1024b1003","FCFP4_1024b1004","FCFP4_1024b1005","FCFP4_1024b1006","FCFP4_1024b1007","FCFP4_1024b1008","FCFP4_1024b1009","FCFP4_1024b101","FCFP4_1024b1010","FCFP4_1024b1011","FCFP4_1024b1012","FCFP4_1024b1013","FCFP4_1024b1014","FCFP4_1024b1015","FCFP4_1024b1016","FCFP4_1024b1017","FCFP4_1024b1018","FCFP4_1024b1019","FCFP4_1024b102","FCFP4_1024b1020","FCFP4_1024b1021","FCFP4_1024b1022","FCFP4_1024b1023","FCFP4_1024b1024","FCFP4_1024b103","FCFP4_1024b104","FCFP4_1024b105","FCFP4_1024b106","FCFP4_1024b107","FCFP4_1024b108","FCFP4_1024b109","FCFP4_1024b11","FCFP4_1024b110","FCFP4_1024b111","FCFP4_1024b112","FCFP4_1024b113","FCFP4_1024b114","FCFP4_1024b115","FCFP4_1024b116","FCFP4_1024b117","FCFP4_1024b118","FCFP4_1024b119","FCFP4_1024b12","FCFP4_1024b120","FCFP4_1024b121","pXC50"
{1 1,2 1,8 1,52 8.387}
{0 CHEMBL1928119,1 1,2 1,8 1,52 7.886}
{0 CHEMBL1928120,1 1,2 1,8 1,52 8.155}
{0 CHEMBL1928121,1 1,2 1,8 1,52 8.854}
{0 CHEMBL1928122,1 1,2 1,8 1,52 9.013}
{0 CHEMBL1928123,1 1,2 1,52 7.854}
{0 CHEMBL1928124,1 1,2 1,52 8.046}
{0 CHEMBL1928125,1 1,2 1,52 8.721}
{0 CHEMBL1928126,1 1,2 1,52 8.959}
{0 CHEMBL1928127,1 1,2 1,52 8.377}
{0 CHEMBL1928128,1 1,2 1,52 8.658}
{0 CHEMBL1928129,1 1,2 1,52 8.187}
{0 CHEMBL1928130,1 1,2 1,52 8.337}
{0 CHEMBL1928131,1 1,2 1,52 8.051}
{0 CHEMBL1928132,1 1,2 1,52 8.456}
{0 CHEMBL1928133,1 1,2 1,8 1,52 8.018}
{0 CHEMBL1928134,1 1,2 1,8 1,52 8.921}
{0 CHEMBL1928135,1 1,2 1,52 7.721}
{0 CHEMBL1928136,1 1,2 1,52 8.921}
{0 CHEMBL1928137,1 1,2 1,8 1,52 8.959}
{0 CHEMBL1928138,1 1,2 1,52 8.456}
{0 CHEMBL1928139,1 1,2 1,52 9.076}
{0 CHEMBL1928247,1 1,2 1,52 5.745}
{0 CHEMBL1928248,1 1,2 1,52 6.699}
