{
  "data_set_description": {
    "collection_date": "November 2013",
    "creator": "Dr Jeremy Besnard, Dr Ivan Olier, Dr Noureddin Sadawi, Dr Larisa Soldatova, Dr Crina Grosan, Prof Ross King, Dr Richard Bickerton, Prof Andrew Hopkins and Dr Willem van Hoorn",
    "default_target_attribute": "pXC50",
    "description": "This dataset contains QSAR data (from ChEMBL version 17) showing activity values (unit is pseudo-pCI50) of several compounds on drug target ChEMBL_ID: CHEMBL2041 (TID: 100079), and it has 1024 rows and 1384 features (not including molecule IDs and class feature: molecule_id and pXC50). The features represent Molecular Descriptors which were generated from SMILES strings. Missing value imputation was applied to this dataset (By choosing the Median).",
    "description_version": "1",
    "file_id": "3411652",
    "format": "ARFF",
    "id": "30128",
    "licence": "Public",
    "md5_checksum": "24cef827372e78fcce86154e05d01c11",
    "minio_url": "https://data.openml.org/datasets/0003/30128/dataset_30128.pq",
    "name": "QSAR-DATASET-FOR-DRUG-TARGET-CHEMBL2041",
    "original_data_url": "https://www.ebi.ac.uk/chembl/target/inspect/CHEMBL2041",
    "parquet_url": "https://data.openml.org/datasets/0003/30128/dataset_30128.pq",
    "processing_date": "2018-10-04 01:48:23",
    "row_id_attribute": "molecule_id",
    "status": "deactivated",
    "tag": [
      "MetaQSAR",
      "study_13"
    ],
    "upload_date": "2016-07-15T04:13:44",
    "url": "https://api.openml.org/data/v1/download/3411652/QSAR-DATASET-FOR-DRUG-TARGET-CHEMBL2041.arff",
    "version": "7",
    "visibility": "public"
  }
}