{
  "data_qualities": {
    "quality": [
      {
        "name": "AutoCorrelation",
        "value": "0.1929310344827591"
      },
      {
        "name": "ClassEntropy",
        "value": []
      },
      {
        "name": "Dimensionality",
        "value": "0.05369807497467072"
      },
      {
        "name": "EquivalentNumberOfAtts",
        "value": []
      },
      {
        "name": "MajorityClassPercentage",
        "value": []
      },
      {
        "name": "MajorityClassSize",
        "value": []
      },
      {
        "name": "MaxAttributeEntropy",
        "value": []
      },
      {
        "name": "MaxKurtosisOfNumericAtts",
        "value": "986.9999999999903"
      },
      {
        "name": "MaxMeansOfNumericAtts",
        "value": "5.7076940222897665"
      },
      {
        "name": "MaxMutualInformation",
        "value": []
      },
      {
        "name": "MaxNominalAttDistinctValues",
        "value": []
      },
      {
        "name": "MaxSkewnessOfNumericAtts",
        "value": "31.41655614481077"
      },
      {
        "name": "MaxStdDevOfNumericAtts",
        "value": "0.807114244230699"
      },
      {
        "name": "MeanAttributeEntropy",
        "value": []
      },
      {
        "name": "MeanKurtosisOfNumericAtts",
        "value": "66.23200729837811"
      },
      {
        "name": "MeanMeansOfNumericAtts",
        "value": "0.18925831969448986"
      },
      {
        "name": "MeanMutualInformation",
        "value": []
      },
      {
        "name": "MeanNoiseToSignalRatio",
        "value": []
      },
      {
        "name": "MeanNominalAttDistinctValues",
        "value": []
      },
      {
        "name": "MeanSkewnessOfNumericAtts",
        "value": "6.229676977136261"
      },
      {
        "name": "MeanStdDevOfNumericAtts",
        "value": "0.20826042962667515"
      },
      {
        "name": "MinAttributeEntropy",
        "value": []
      },
      {
        "name": "MinKurtosisOfNumericAtts",
        "value": "-1.9915421591911713"
      },
      {
        "name": "MinMeansOfNumericAtts",
        "value": "0.0"
      },
      {
        "name": "MinMutualInformation",
        "value": []
      },
      {
        "name": "MinNominalAttDistinctValues",
        "value": []
      },
      {
        "name": "MinSkewnessOfNumericAtts",
        "value": "-4.734653643597518"
      },
      {
        "name": "MinStdDevOfNumericAtts",
        "value": "0.0"
      },
      {
        "name": "MinorityClassPercentage",
        "value": []
      },
      {
        "name": "MinorityClassSize",
        "value": []
      },
      {
        "name": "NumberOfBinaryFeatures",
        "value": "0.0"
      },
      {
        "name": "NumberOfClasses",
        "value": "0.0"
      },
      {
        "name": "NumberOfFeatures",
        "value": "53.0"
      },
      {
        "name": "NumberOfInstances",
        "value": "987.0"
      },
      {
        "name": "NumberOfInstancesWithMissingValues",
        "value": "0.0"
      },
      {
        "name": "NumberOfMissingValues",
        "value": "0.0"
      },
      {
        "name": "NumberOfNumericFeatures",
        "value": "52.0"
      },
      {
        "name": "NumberOfSymbolicFeatures",
        "value": "1.0"
      },
      {
        "name": "PercentageOfBinaryFeatures",
        "value": "0.0"
      },
      {
        "name": "PercentageOfInstancesWithMissingValues",
        "value": "0.0"
      },
      {
        "name": "PercentageOfMissingValues",
        "value": "0.0"
      },
      {
        "name": "PercentageOfNumericFeatures",
        "value": "98.11320754716981"
      },
      {
        "name": "PercentageOfSymbolicFeatures",
        "value": "1.8867924528301887"
      },
      {
        "name": "Quartile1AttributeEntropy",
        "value": []
      },
      {
        "name": "Quartile1KurtosisOfNumericAtts",
        "value": "6.883919647424441"
      },
      {
        "name": "Quartile1MeansOfNumericAtts",
        "value": "0.01215805471124623"
      },
      {
        "name": "Quartile1MutualInformation",
        "value": []
      },
      {
        "name": "Quartile1SkewnessOfNumericAtts",
        "value": "2.9782502497904932"
      },
      {
        "name": "Quartile1StdDevOfNumericAtts",
        "value": "0.10964678373778972"
      },
      {
        "name": "Quartile2AttributeEntropy",
        "value": []
      },
      {
        "name": "Quartile2KurtosisOfNumericAtts",
        "value": "24.193548766781692"
      },
      {
        "name": "Quartile2MeansOfNumericAtts",
        "value": "0.033434650455927015"
      },
      {
        "name": "Quartile2MutualInformation",
        "value": []
      },
      {
        "name": "Quartile2SkewnessOfNumericAtts",
        "value": "5.113172044957997"
      },
      {
        "name": "Quartile2StdDevOfNumericAtts",
        "value": "0.17983770304703942"
      },
      {
        "name": "Quartile3AttributeEntropy",
        "value": []
      },
      {
        "name": "Quartile3KurtosisOfNumericAtts",
        "value": "77.66124361355105"
      },
      {
        "name": "Quartile3MeansOfNumericAtts",
        "value": "0.08510638297872354"
      },
      {
        "name": "Quartile3MutualInformation",
        "value": []
      },
      {
        "name": "Quartile3SkewnessOfNumericAtts",
        "value": "8.916494777970124"
      },
      {
        "name": "Quartile3StdDevOfNumericAtts",
        "value": "0.27484627811132256"
      },
      {
        "name": "StdvNominalAttDistinctValues",
        "value": []
      }
    ]
  }
}