"molecule_id","FCFP4_1024b815","FCFP4_1024b909","FCFP4_1024b816","FCFP4_1024b68","FCFP4_1024b1","FCFP4_1024b10","FCFP4_1024b100","FCFP4_1024b1000","FCFP4_1024b1001","FCFP4_1024b1002","FCFP4_1024b1003","FCFP4_1024b1004","FCFP4_1024b1005","FCFP4_1024b1006","FCFP4_1024b1007","FCFP4_1024b1008","FCFP4_1024b1009","FCFP4_1024b101","FCFP4_1024b1010","FCFP4_1024b1011","FCFP4_1024b1012","FCFP4_1024b1013","FCFP4_1024b1014","FCFP4_1024b1015","FCFP4_1024b1016","FCFP4_1024b1017","FCFP4_1024b1018","FCFP4_1024b1019","FCFP4_1024b102","FCFP4_1024b1020","FCFP4_1024b1021","FCFP4_1024b1022","FCFP4_1024b1023","FCFP4_1024b1024","FCFP4_1024b103","FCFP4_1024b104","FCFP4_1024b105","FCFP4_1024b106","FCFP4_1024b107","FCFP4_1024b108","FCFP4_1024b109","FCFP4_1024b11","FCFP4_1024b110","FCFP4_1024b111","FCFP4_1024b112","FCFP4_1024b113","FCFP4_1024b114","FCFP4_1024b115","FCFP4_1024b116","FCFP4_1024b117","FCFP4_1024b118","FCFP4_1024b119","FCFP4_1024b12","FCFP4_1024b120","FCFP4_1024b121","FCFP4_1024b122","FCFP4_1024b123","FCFP4_1024b124","FCFP4_1024b125","FCFP4_1024b126","FCFP4_1024b127","FCFP4_1024b128","FCFP4_1024b129","FCFP4_1024b13","FCFP4_1024b130","FCFP4_1024b131","FCFP4_1024b132","FCFP4_1024b133","FCFP4_1024b134","FCFP4_1024b135","FCFP4_1024b136","FCFP4_1024b137","FCFP4_1024b138","FCFP4_1024b139","FCFP4_1024b14","FCFP4_1024b140","FCFP4_1024b141","FCFP4_1024b142","FCFP4_1024b143","FCFP4_1024b144","FCFP4_1024b145","FCFP4_1024b146","FCFP4_1024b147","FCFP4_1024b148","FCFP4_1024b149","FCFP4_1024b15","FCFP4_1024b150","FCFP4_1024b151","FCFP4_1024b152","FCFP4_1024b153","FCFP4_1024b154","FCFP4_1024b155","FCFP4_1024b156","FCFP4_1024b157","FCFP4_1024b158","FCFP4_1024b159","FCFP4_1024b16","FCFP4_1024b160","FCFP4_1024b161","FCFP4_1024b162","FCFP4_1024b163","FCFP4_1024b164","pXC50"
{1 1,2 1,3 1,5 1,6 1,30 1,37 1,51 1,89 1,103 7.62}
{0 CHEMBL106189,1 1,2 1,3 1,5 1,6 1,30 1,40 1,51 1,89 1,97 1,103 8.726}
{0 CHEMBL106876,3 1,4 1,5 1,6 1,40 1,62 1,89 1,103 9.357}
{0 CHEMBL107157,3 1,4 1,5 1,6 1,30 1,40 1,62 1,89 1,103 8.839}
{0 CHEMBL107164,1 1,2 1,3 1,5 1,6 1,40 1,51 1,89 1,103 9.481}
{0 CHEMBL108406,1 1,2 1,3 1,5 1,6 1,30 1,40 1,51 1,89 1,103 9.284}
{0 CHEMBL108794,3 1,4 1,5 1,6 1,40 1,62 1,89 1,103 8.996}
{0 CHEMBL109100,3 1,4 1,5 1,6 1,30 1,40 1,62 1,89 1,103 8.424}
{0 CHEMBL110238,1 1,2 1,3 1,4 1,5 1,6 1,40 1,89 1,103 8.839}
{0 CHEMBL110282,1 1,2 1,3 1,4 1,5 1,6 1,30 1,40 1,89 1,103 9.06}
{0 CHEMBL110666,3 1,5 1,6 1,40 1,51 1,62 1,89 1,97 1,103 7.441}
{0 CHEMBL110773,1 1,2 1,3 1,4 1,5 1,6 1,40 1,89 1,103 9.553}
{0 CHEMBL14680,1 1,2 1,3 1,4 1,5 1,6 1,30 1,89 1,103 8.71}
{0 CHEMBL163704,1 1,2 1,3 1,4 1,5 1,6 1,30 1,103 8.167}
{0 CHEMBL166355,1 1,2 1,3 1,4 1,5 1,6 1,30 1,103 8.824}
{0 CHEMBL2021332,1 1,2 1,3 1,5 1,6 1,30 1,103 9.119}
{0 CHEMBL2021333,3 1,5 1,6 1,30 1,62 1,103 6.363}
{0 CHEMBL2021335,1 1,2 1,3 1,5 1,6 1,103 7.201}
{0 CHEMBL2304424,1 1,2 1,3 1,5 1,6 1,30 1,51 1,89 1,103 8.854}
{0 CHEMBL281786,1 1,2 1,3 1,5 1,6 1,30 1,103 8.854}
{0 CHEMBL285250,5 1,6 1,103 7.721}
{0 CHEMBL287726,5 1,6 1,25 1,103 6.721}
{0 CHEMBL288178,1 1,2 1,3 1,4 1,5 1,6 1,30 1,89 1,103 7.629}
{0 CHEMBL289426,1 1,2 1,3 1,5 1,6 1,30 1,89 1,103 9.678}
{0 CHEMBL290616,1 1,2 1,3 1,4 1,5 1,6 1,89 1,103 8.237}
{0 CHEMBL290701,1 1,2 1,3 1,4 1,5 1,6 1,30 1,89 1,103 8.446}
{0 CHEMBL290855,5 1,6 1,103 7.553}
{0 CHEMBL294226,5 1,103 8.701}
{0 CHEMBL294616,5 1,30 1,89 1,103 6.337}
{0 CHEMBL297605,1 1,2 1,3 1,5 1,6 1,30 1,51 1,89 1,103 8.538}
{0 CHEMBL299460,5 1,6 1,103 6.071}
{0 CHEMBL301421,5 1,6 1,103 5.695}
{0 CHEMBL308292,1 1,2 1,3 1,5 1,6 1,30 1,103 9.495}
{0 CHEMBL317035,1 1,2 1,3 1,4 1,5 1,6 1,30 1,40 1,89 1,103 8.108}
{0 CHEMBL320060,3 1,5 1,6 1,40 1,51 1,62 1,89 1,103 6.981}
{0 CHEMBL323430,1 1,2 1,3 1,5 1,6 1,40 1,51 1,89 1,97 1,103 9.097}
{0 CHEMBL327111,3 1,5 1,6 1,30 1,40 1,51 1,62 1,89 1,103 7.495}
{0 CHEMBL350384,3 1,5 1,6 1,20 1,103 9.301}
{0 CHEMBL36707,5 1,6 1,103 6.561}
{0 CHEMBL409026,5 1,103 7.388}
{0 CHEMBL41098,1 1,2 1,3 1,4 1,5 1,6 1,30 1,89 1,103 9.398}
{0 CHEMBL413258,3 1,5 1,6 1,30 1,40 1,51 1,62 1,89 1,97 1,103 7.434}
{0 CHEMBL41366,1 1,2 1,3 1,5 1,6 1,89 1,103 9.252}
{0 CHEMBL418460,5 1,6 1,103 6.747}
{0 CHEMBL431947,5 1,6 1,103 7.657}
{0 CHEMBL442547,1 1,2 1,3 1,4 1,5 1,6 1,30 1,89 1,103 9.398}
{0 CHEMBL554230,5 1,6 1,14 1,30 1,54 1,57 1,75 1,103 4.886}
{0 CHEMBL57879,5 1,40 1,103 6.42}
{0 CHEMBL58059,5 1,40 1,103 7.038}
{0 CHEMBL59840,5 1,74 1,103 5.42}
{0 CHEMBL60270,5 1,6 1,103 7.558}
{0 CHEMBL606710,1 1,2 1,3 1,4 1,5 1,6 1,89 1,103 9.201}
{0 CHEMBL610531,1 1,2 1,3 1,4 1,5 1,6 1,30 1,103 8.745}
{0 CHEMBL61644,5 1,6 1,66 1,103 6.991}
{0 CHEMBL70,1 1,2 1,3 1,5 1,6 1,102 1,103 9.174}
{0 CHEMBL72153,3 1,5 1,6 1,62 1,103 5.936}
{0 CHEMBL72929,1 1,2 1,3 1,5 1,6 1,30 1,37 1,103 9}
{0 CHEMBL73352,1 1,2 1,3 1,5 1,6 1,103 8.208}
{0 CHEMBL75272,3 1,5 1,6 1,62 1,103 6.491}
{0 CHEMBL75324,3 1,5 1,6 1,30 1,62 1,103 6.767}
{0 CHEMBL75776,3 1,5 1,6 1,37 1,51 1,103 7.469}
{0 CHEMBL80,1 1,2 1,3 1,4 1,5 1,6 1,35 1,103 8.301}
