"molecule_id","FCFP4_1024b33","FCFP4_1024b1","FCFP4_1024b10","FCFP4_1024b100","FCFP4_1024b1000","FCFP4_1024b1001","FCFP4_1024b1002","FCFP4_1024b1003","FCFP4_1024b1004","FCFP4_1024b1005","FCFP4_1024b1006","FCFP4_1024b1007","FCFP4_1024b1008","FCFP4_1024b1009","FCFP4_1024b101","FCFP4_1024b1010","FCFP4_1024b1011","FCFP4_1024b1012","FCFP4_1024b1013","FCFP4_1024b1014","FCFP4_1024b1015","FCFP4_1024b1016","FCFP4_1024b1017","FCFP4_1024b1018","FCFP4_1024b1019","FCFP4_1024b102","FCFP4_1024b1020","FCFP4_1024b1021","FCFP4_1024b1022","FCFP4_1024b1023","FCFP4_1024b1024","FCFP4_1024b103","FCFP4_1024b104","FCFP4_1024b105","FCFP4_1024b106","FCFP4_1024b107","FCFP4_1024b108","FCFP4_1024b109","FCFP4_1024b11","FCFP4_1024b110","FCFP4_1024b111","FCFP4_1024b112","FCFP4_1024b113","FCFP4_1024b114","FCFP4_1024b115","FCFP4_1024b116","FCFP4_1024b117","FCFP4_1024b118","FCFP4_1024b119","FCFP4_1024b12","FCFP4_1024b120","FCFP4_1024b121","FCFP4_1024b122","FCFP4_1024b123","FCFP4_1024b124","FCFP4_1024b125","FCFP4_1024b126","FCFP4_1024b127","FCFP4_1024b128","FCFP4_1024b129","FCFP4_1024b13","FCFP4_1024b130","FCFP4_1024b131","FCFP4_1024b132","FCFP4_1024b133","FCFP4_1024b134","FCFP4_1024b135","FCFP4_1024b136","FCFP4_1024b137","FCFP4_1024b138","FCFP4_1024b139","FCFP4_1024b14","FCFP4_1024b140","FCFP4_1024b141","FCFP4_1024b142","FCFP4_1024b143","FCFP4_1024b144","FCFP4_1024b145","FCFP4_1024b146","FCFP4_1024b147","FCFP4_1024b148","FCFP4_1024b149","FCFP4_1024b15","FCFP4_1024b150","FCFP4_1024b151","FCFP4_1024b152","FCFP4_1024b153","FCFP4_1024b154","FCFP4_1024b155","FCFP4_1024b156","FCFP4_1024b157","FCFP4_1024b158","FCFP4_1024b159","FCFP4_1024b16","FCFP4_1024b160","FCFP4_1024b161","FCFP4_1024b162","FCFP4_1024b163","FCFP4_1024b164","FCFP4_1024b165","FCFP4_1024b166","FCFP4_1024b167","pXC50"
{2 1,87 1,103 6}
{0 CHEMBL1915888,2 1,87 1,100 1,103 5.509}
{0 CHEMBL1915891,1 1,2 1,71 1,87 1,100 1,103 6}
{0 CHEMBL1915892,1 1,2 1,71 1,87 1,100 1,103 6}
{0 CHEMBL1915896,2 1,7 1,87 1,100 1,103 5.728}
{0 CHEMBL1915906,2 1,87 1,95 1,100 1,103 5.75}
{0 CHEMBL1915910,2 1,87 1,100 1,103 5}
{0 CHEMBL1915912,2 1,87 1,100 1,103 5.876}
{0 CHEMBL1916091,2 1,87 1,100 1,103 5.788}
{0 CHEMBL1916106,1 1,2 1,17 1,100 1,103 5}
{0 CHEMBL1916108,1 1,2 1,17 1,50 1,100 1,103 5.301}
{0 CHEMBL1916113,1 1,2 1,12 1,17 1,59 1,100 1,103 5.301}
{0 CHEMBL1916114,1 1,2 1,12 1,59 1,69 1,100 1,103 4.863}
{0 CHEMBL1916123,2 1,59 1,87 1,100 1,103 5.447}
{0 CHEMBL1916124,2 1,17 1,59 1,100 1,103 5.463}
{0 CHEMBL1916125,2 1,59 1,69 1,100 1,103 5.638}
{0 CHEMBL1916130,1 1,2 1,17 1,50 1,59 1,100 1,103 6.301}
{0 CHEMBL1916131,1 1,2 1,10 1,17 1,59 1,100 1,103 6}
{0 CHEMBL1916132,1 1,2 1,10 1,17 1,50 1,100 1,103 6}
{0 CHEMBL192,2 1,3 1,19 1,25 1,103 6.854}
{0 CHEMBL521075,1 1,2 1,36 1,54 1,59 1,76 1,86 1,97 1,103 6.337}
{0 CHEMBL592986,1 1,2 1,36 1,54 1,59 1,76 1,103 5.959}
{0 CHEMBL593225,1 1,2 1,3 1,36 1,54 1,59 1,76 1,103 5.1}
{0 CHEMBL594160,1 1,2 1,36 1,38 1,54 1,59 1,76 1,83 1,103 6.854}
{0 CHEMBL595104,1 1,2 1,36 1,54 1,59 1,73 1,76 1,103 6.469}
{0 CHEMBL596489,1 1,2 1,26 1,36 1,54 1,59 1,76 1,103 6.222}
{0 CHEMBL603422,1 1,2 1,26 1,36 1,54 1,59 1,76 1,103 6.149}
{0 CHEMBL604271,1 1,2 1,36 1,54 1,59 1,76 1,103 6.495}
{0 CHEMBL779,2 1,27 1,51 1,54 1,89 1,103 5.523}
