"molecule_id","FCFP4_1024b983","FCFP4_1024b1020","FCFP4_1024b190","FCFP4_1024b697","FCFP4_1024b279","FCFP4_1024b297","FCFP4_1024b466","FCFP4_1024b693","FCFP4_1024b726","FCFP4_1024b412","FCFP4_1024b256","FCFP4_1024b348","FCFP4_1024b406","FCFP4_1024b923","FCFP4_1024b985","FCFP4_1024b942","FCFP4_1024b2","FCFP4_1024b220","FCFP4_1024b222","FCFP4_1024b535","FCFP4_1024b58","FCFP4_1024b376","FCFP4_1024b65","FCFP4_1024b250","FCFP4_1024b240","FCFP4_1024b423","FCFP4_1024b768","FCFP4_1024b429","FCFP4_1024b271","FCFP4_1024b492","FCFP4_1024b669","FCFP4_1024b847","FCFP4_1024b804","FCFP4_1024b25","FCFP4_1024b18","FCFP4_1024b809","FCFP4_1024b46","FCFP4_1024b957","FCFP4_1024b521","FCFP4_1024b286","FCFP4_1024b530","FCFP4_1024b961","FCFP4_1024b1","FCFP4_1024b10","FCFP4_1024b100","FCFP4_1024b1000","FCFP4_1024b1001","FCFP4_1024b1002","FCFP4_1024b1003","FCFP4_1024b1004","FCFP4_1024b1005","pXC50"
{1 1,2 1,3 1,4 1,7 1,9 1,12 1,16 1,24 1,25 1,26 1,27 1,28 1,30 1,32 1,33 1,34 1,36 1,37 1,40 1,41 1,43 1,44 1,52 6.553}
{0 CHEMBL1269844,1 1,2 1,3 1,4 1,7 1,9 1,12 1,16 1,24 1,25 1,26 1,27 1,28 1,30 1,32 1,33 1,34 1,36 1,37 1,40 1,41 1,43 1,44 1,52 6.924}
{0 CHEMBL1269950,1 1,2 1,3 1,4 1,7 1,9 1,12 1,16 1,24 1,25 1,26 1,27 1,28 1,30 1,32 1,33 1,34 1,36 1,37 1,40 1,41 1,43 1,44 1,52 5.88}
{0 CHEMBL1269951,1 1,2 1,7 1,9 1,16 1,17 1,24 1,25 1,26 1,27 1,28 1,32 1,33 1,34 1,36 1,40 1,43 1,44 1,52 5}
{0 CHEMBL1269952,1 1,2 1,3 1,4 1,7 1,9 1,12 1,16 1,24 1,28 1,30 1,32 1,33 1,34 1,36 1,43 1,44 1,52 6.244}
{0 CHEMBL1270058,1 1,2 1,3 1,4 1,7 1,9 1,12 1,16 1,24 1,28 1,30 1,32 1,33 1,34 1,36 1,43 1,44 1,52 6.319}
{0 CHEMBL1270059,1 1,2 1,3 1,4 1,7 1,9 1,12 1,16 1,24 1,28 1,30 1,32 1,33 1,34 1,36 1,43 1,44 1,52 7.071}
{0 CHEMBL1270060,1 1,2 1,3 1,4 1,7 1,9 1,12 1,16 1,24 1,25 1,26 1,27 1,28 1,30 1,32 1,33 1,34 1,37 1,41 1,43 1,44 1,52 6.092}
{0 CHEMBL1270165,1 1,2 1,3 1,4 1,7 1,9 1,12 1,16 1,24 1,28 1,30 1,32 1,33 1,34 1,43 1,44 1,52 6.914}
{0 CHEMBL1270166,1 1,2 1,3 1,4 1,7 1,12 1,16 1,25 1,26 1,27 1,28 1,30 1,32 1,33 1,34 1,36 1,37 1,40 1,41 1,42 1,43 1,44 1,52 6.553}
{0 CHEMBL1270167,1 1,2 1,3 1,4 1,7 1,12 1,16 1,28 1,30 1,32 1,33 1,34 1,36 1,42 1,43 1,44 1,52 6.462}
{0 CHEMBL1270264,1 1,2 1,3 1,4 1,9 1,12 1,16 1,24 1,25 1,26 1,27 1,28 1,30 1,32 1,33 1,34 1,35 1,37 1,39 1,40 1,41 1,43 1,44 1,52 6.161}
{0 CHEMBL1270265,1 1,2 1,3 1,4 1,9 1,12 1,16 1,24 1,25 1,26 1,27 1,28 1,30 1,32 1,33 1,34 1,35 1,37 1,39 1,41 1,43 1,44 1,52 5.012}
{0 CHEMBL14690,17 1,31 1,33 1,34 1,35 1,39 1,43 1,52 9.111}
{0 CHEMBL1641821,10 1,17 1,18 1,19 1,20 1,21 1,31 1,35 1,39 1,43 1,44 1,52 7.328}
{0 CHEMBL1824230,5 1,6 1,8 1,11 1,13 1,14 1,15 1,17 1,22 1,23 1,28 1,29 1,31 1,33 1,34 1,35 1,38 1,42 1,43 1,44 1,52 9.553}
{0 CHEMBL1824231,5 1,6 1,8 1,11 1,13 1,14 1,15 1,17 1,22 1,23 1,28 1,29 1,31 1,33 1,34 1,35 1,38 1,42 1,43 1,44 1,52 9.284}
{0 CHEMBL1824233,5 1,6 1,8 1,11 1,13 1,14 1,15 1,17 1,22 1,23 1,28 1,29 1,31 1,33 1,34 1,35 1,38 1,42 1,43 1,44 1,52 8.796}
{0 CHEMBL1824234,5 1,6 1,8 1,11 1,13 1,14 1,15 1,17 1,22 1,23 1,28 1,29 1,31 1,33 1,34 1,35 1,38 1,42 1,43 1,44 1,52 9}
{0 CHEMBL1824235,5 1,6 1,8 1,11 1,13 1,14 1,15 1,17 1,22 1,23 1,28 1,29 1,31 1,33 1,34 1,35 1,38 1,42 1,43 1,44 1,52 9.481}
{0 CHEMBL1824236,5 1,6 1,8 1,11 1,13 1,14 1,15 1,17 1,22 1,23 1,28 1,29 1,31 1,33 1,34 1,35 1,38 1,42 1,43 1,44 1,52 9}
{0 CHEMBL1824239,5 1,6 1,8 1,11 1,13 1,14 1,15 1,17 1,22 1,23 1,28 1,29 1,31 1,33 1,34 1,35 1,38 1,42 1,43 1,44 1,52 8.638}
{0 CHEMBL1824241,5 1,6 1,8 1,11 1,13 1,14 1,15 1,17 1,22 1,23 1,28 1,29 1,31 1,33 1,34 1,35 1,38 1,42 1,43 1,44 1,52 8.796}
{0 CHEMBL1824245,5 1,6 1,8 1,11 1,13 1,14 1,15 1,17 1,22 1,23 1,28 1,29 1,31 1,33 1,34 1,35 1,38 1,41 1,42 1,43 1,44 1,52 8.854}
{0 CHEMBL1824247,5 1,6 1,8 1,11 1,13 1,14 1,15 1,17 1,22 1,23 1,28 1,29 1,31 1,33 1,34 1,35 1,38 1,43 1,44 1,52 8.678}
{0 CHEMBL1935574,1 1,2 1,10 1,16 1,17 1,29 1,31 1,35 1,39 1,43 1,52 5.971}
{0 CHEMBL19439,17 1,24 1,30 1,31 1,35 1,39 1,43 1,52 8.699}
{0 CHEMBL2031600,10 1,17 1,18 1,19 1,20 1,21 1,31 1,35 1,39 1,43 1,44 1,52 7.398}
{0 CHEMBL2031602,10 1,17 1,18 1,19 1,20 1,21 1,31 1,35 1,39 1,43 1,44 1,52 8.62}
{0 CHEMBL2031605,1 1,10 1,16 1,17 1,18 1,19 1,20 1,21 1,31 1,35 1,39 1,43 1,44 1,52 8.143}
{0 CHEMBL2031616,8 1,10 1,17 1,18 1,19 1,20 1,21 1,22 1,23 1,28 1,31 1,34 1,35 1,39 1,43 1,44 1,48 1,52 7.921}
{0 CHEMBL2031618,10 1,17 1,18 1,19 1,20 1,21 1,31 1,35 1,39 1,43 1,44 1,52 7.602}
{0 CHEMBL2031619,10 1,17 1,18 1,19 1,20 1,21 1,31 1,35 1,39 1,43 1,44 1,52 8.585}
{0 CHEMBL2048411,10 1,17 1,18 1,19 1,20 1,21 1,31 1,35 1,39 1,43 1,44 1,52 7.276}
{0 CHEMBL2048412,10 1,17 1,18 1,19 1,20 1,21 1,22 1,23 1,31 1,35 1,39 1,43 1,44 1,52 7.495}
{0 CHEMBL2048413,10 1,17 1,18 1,19 1,20 1,21 1,31 1,35 1,39 1,43 1,44 1,52 6.921}
{0 CHEMBL2048414,10 1,17 1,18 1,19 1,20 1,21 1,31 1,35 1,39 1,43 1,44 1,50 1,52 7.215}
{0 CHEMBL2048581,10 1,17 1,18 1,19 1,20 1,21 1,31 1,35 1,39 1,43 1,44 1,52 7.745}
{0 CHEMBL2048582,5 1,6 1,10 1,17 1,18 1,19 1,20 1,21 1,31 1,33 1,34 1,35 1,38 1,39 1,43 1,44 1,52 6.959}
{0 CHEMBL2048583,10 1,16 1,17 1,18 1,19 1,20 1,21 1,31 1,35 1,39 1,43 1,44 1,52 7.337}
{0 CHEMBL2048584,10 1,17 1,18 1,19 1,20 1,21 1,30 1,31 1,35 1,39 1,43 1,44 1,52 7.167}
{0 CHEMBL2048585,10 1,17 1,18 1,19 1,20 1,21 1,31 1,35 1,39 1,43 1,44 1,52 7.252}
{0 CHEMBL2048586,10 1,17 1,18 1,19 1,20 1,21 1,31 1,32 1,35 1,39 1,43 1,44 1,52 7.456}
{0 CHEMBL2048587,10 1,17 1,18 1,19 1,20 1,21 1,31 1,35 1,39 1,43 1,44 1,52 7.31}
{0 CHEMBL2048588,10 1,17 1,18 1,19 1,20 1,21 1,31 1,35 1,39 1,43 1,44 1,52 7.357}
{0 CHEMBL2048589,10 1,17 1,18 1,19 1,20 1,21 1,31 1,35 1,39 1,42 1,43 1,44 1,52 8.301}
{0 CHEMBL2048590,10 1,16 1,17 1,18 1,19 1,20 1,21 1,31 1,35 1,39 1,43 1,44 1,52 7.268}
{0 CHEMBL2048591,10 1,12 1,17 1,18 1,19 1,20 1,21 1,30 1,31 1,35 1,39 1,43 1,44 1,52 7.26}
{0 CHEMBL2048592,10 1,17 1,18 1,19 1,20 1,21 1,31 1,35 1,39 1,43 1,44 1,52 8.155}
{0 CHEMBL2048593,10 1,12 1,17 1,18 1,19 1,20 1,21 1,30 1,31 1,35 1,39 1,43 1,44 1,52 7.114}
{0 CHEMBL2048594,10 1,17 1,18 1,19 1,20 1,21 1,31 1,35 1,38 1,39 1,43 1,44 1,52 7.567}
{0 CHEMBL2048595,10 1,17 1,18 1,19 1,20 1,21 1,31 1,35 1,38 1,39 1,43 1,44 1,52 7.796}
{0 CHEMBL260374,17 1,31 1,35 1,38 1,39 1,43 1,52 7.959}
{0 CHEMBL268490,35 1,39 1,43 1,52 7.721}
{0 CHEMBL483400,10 1,17 1,22 1,23 1,28 1,29 1,32 1,34 1,35 1,42 1,43 1,44 1,52 8.076}
{0 CHEMBL484946,10 1,17 1,22 1,23 1,28 1,29 1,32 1,33 1,34 1,35 1,42 1,43 1,44 1,52 8.409}
{0 CHEMBL485543,10 1,17 1,22 1,23 1,28 1,29 1,32 1,33 1,34 1,35 1,42 1,43 1,44 1,52 8.409}
{0 CHEMBL488248,10 1,11 1,13 1,14 1,15 1,16 1,17 1,22 1,23 1,28 1,29 1,31 1,33 1,34 1,43 1,44 1,52 8.319}
{0 CHEMBL495698,11 1,13 1,14 1,15 1,17 1,22 1,23 1,28 1,29 1,31 1,35 1,39 1,43 1,44 1,52 8.745}
{0 CHEMBL557214,10 1,11 1,13 1,14 1,15 1,17 1,22 1,23 1,28 1,29 1,31 1,32 1,33 1,34 1,43 1,44 1,52 8.547}
{0 CHEMBL560386,11 1,13 1,14 1,15 1,16 1,17 1,22 1,23 1,28 1,29 1,31 1,32 1,33 1,34 1,43 1,44 1,52 8.229}
{0 CHEMBL574387,10 1,17 1,18 1,19 1,20 1,21 1,31 1,32 1,35 1,39 1,43 1,44 1,52 7.699}
{0 CHEMBL575023,10 1,17 1,18 1,19 1,20 1,21 1,31 1,35 1,39 1,43 1,44 1,52 7.051}
{0 CHEMBL575241,2 1,10 1,17 1,18 1,19 1,20 1,21 1,31 1,35 1,39 1,43 1,44 1,52 7.495}
{0 CHEMBL575474,10 1,17 1,18 1,19 1,20 1,21 1,31 1,35 1,39 1,43 1,44 1,52 7.125}
{0 CHEMBL575476,10 1,17 1,18 1,19 1,20 1,21 1,31 1,35 1,39 1,43 1,44 1,52 7.18}
{0 CHEMBL578834,10 1,17 1,18 1,19 1,20 1,21 1,31 1,35 1,39 1,43 1,44 1,52 7.699}
{0 CHEMBL90,30 1,35 1,39 1,43 1,52 7.167}
