"molecule_id","AMW","C.","H.","Me","Mi","Mp","Mv","MW","N.","nAB","nAT","nB","nBM","nBO","nBR","nBT","nC","nCL","nCsp","nCsp2","nCsp3","nDB","nF","nH","nHet","nHM","nI","nN","nO","nP","nS","nSK","nTB","nX","O.","RBF","RBN","SCBO","Se","Si","Sp","Sv","X.","pXC50"
{1 8.039,2 43.8,3 45.3,4 1.005,5 1.116,6 0.687,7 0.647,8 514.48,9 1.6,10 18,11 64,13 19,14 38,16 67,17 28,18 2,20 19,21 9,22 1,24 29,25 7,26 2,28 1,29 4,32 35,34 2,35 6.3,36 0.134,37 9,38 48,39 64.312,40 71.452,41 43.96,42 41.438,43 3.1,44 4.409}
{0 CHEMBL277498,1 6.459,2 30,3 55,4 1.009,5 1.15,6 0.586,7 0.554,8 129.18,9 5,11 20,13 1,14 9,16 20,17 6,20 1,21 5,22 1,24 11,25 3,28 1,29 2,32 9,35 10,36 0.05,37 1,38 10,39 20.174,40 22.993,41 11.722,42 11.085,44 4.409}
{0 CHEMBL307361,1 7.246,2 41.7,3 48.6,4 0.998,5 1.118,6 0.665,7 0.621,8 521.73,9 1.4,10 18,11 72,13 19,14 40,16 75,17 30,20 19,21 11,22 1,24 35,25 7,26 1,28 1,29 5,31 1,32 37,35 6.9,36 0.147,37 11,38 50,39 71.836,40 80.524,41 47.87,42 44.738,44 4.076}
{0 CHEMBL308528,1 7.194,2 45,3 48.3,4 0.987,5 1.111,6 0.687,7 0.634,8 431.64,9 1.7,10 18,11 60,13 19,14 34,16 63,17 27,20 19,21 8,22 1,24 29,25 4,26 1,28 1,29 2,31 1,32 31,35 3.3,36 0.127,37 8,38 44,39 59.203,40 66.65,41 41.222,42 38.013,44 4.071}
{0 CHEMBL309357,1 5.689,2 37.7,3 58.5,4 0.975,5 1.131,6 0.62,7 0.559,8 301.52,9 1.9,10 6,11 53,13 6,14 24,16 55,17 20,20 6,21 14,24 31,25 2,28 1,29 1,32 22,35 1.9,36 0.091,37 5,38 27,39 51.683,40 59.936,41 32.881,42 29.638,44 4.523}
{0 CHEMBL310236,1 6.767,2 42.9,3 50,4 0.992,5 1.12,6 0.654,7 0.612,8 473.66,9 1.4,10 18,11 70,13 19,14 38,16 73,17 30,20 19,21 11,22 1,24 35,25 5,28 1,29 4,32 35,35 5.7,36 0.123,37 9,38 48,39 69.432,40 78.394,41 45.767,42 42.836,44 4.347}
{0 CHEMBL432737,1 7.023,2 41.7,3 48.6,4 1.001,5 1.122,6 0.648,7 0.615,8 505.66,9 1.4,10 18,11 72,13 19,14 40,16 75,17 30,20 19,21 11,22 1,24 35,25 7,28 1,29 6,32 37,35 8.3,36 0.147,37 11,38 50,39 72.087,40 80.813,41 46.676,42 44.266,44 4.469}
{0 CHEMBL72499,1 7.525,2 43.8,3 45.3,4 1.011,5 1.129,6 0.658,7 0.634,8 481.58,9 1.6,10 18,11 64,13 19,14 38,16 67,17 28,20 19,21 9,22 1,23 2,24 29,25 7,28 1,29 4,32 35,34 2,35 6.3,36 0.134,37 9,38 48,39 64.69,40 72.243,41 42.12,42 40.549,43 3.1,44 4.31}
{0 CHEMBL75035,1 7.023,2 41.7,3 48.6,4 1.001,5 1.122,6 0.648,7 0.615,8 505.66,9 1.4,10 18,11 72,13 19,14 40,16 75,17 30,20 19,21 11,22 1,24 35,25 7,28 1,29 6,32 37,35 8.3,36 0.147,37 11,38 50,39 72.087,40 80.813,41 46.676,42 44.266,44 4.679}
{0 CHEMBL75800,1 7.155,2 45.2,3 46.8,4 0.996,5 1.115,6 0.669,7 0.633,8 443.58,9 1.6,10 18,11 62,13 19,14 37,16 66,17 28,20 19,21 9,22 1,24 29,25 5,28 1,29 4,32 33,35 6.5,36 0.106,37 7,38 47,39 61.781,40 69.149,41 41.483,42 39.256,44 4.292}
{0 CHEMBL76768,1 7.064,2 33.3,3 50,4 1.016,5 1.143,6 0.609,7 0.587,8 127.16,9 5.6,11 18,13 2,14 9,16 18,17 6,20 3,21 3,22 2,24 9,25 3,28 1,29 2,32 9,35 11.1,36 0.056,37 1,38 11,39 18.291,40 20.578,41 10.96,42 10.558,44 4.237}
{0 CHEMBL77575,1 6.459,2 30,3 55,4 1.009,5 1.15,6 0.586,7 0.554,8 129.18,9 5,11 20,13 1,14 9,16 20,17 6,20 1,21 5,22 1,24 11,25 3,28 1,29 2,32 9,35 10,36 0.05,37 1,38 10,39 20.174,40 22.993,41 11.722,42 11.085,44 4.721}
{0 CHEMBL78166,1 6.995,2 42.6,3 48.5,4 0.998,5 1.12,6 0.654,7 0.618,8 475.63,9 1.5,10 18,11 68,13 19,14 38,16 71,17 29,20 19,21 10,22 1,24 33,25 6,28 1,29 5,32 35,35 7.4,36 0.141,37 10,38 48,39 67.876,40 76.189,41 44.461,42 42.024,44 4.208}
{0 CHEMBL96,1 6.446,2 25,3 56.3,4 1.018,5 1.161,6 0.56,7 0.535,8 103.14,9 6.3,11 16,13 1,14 6,16 15,17 4,20 1,21 3,22 1,24 9,25 3,28 1,29 2,32 7,35 12.5,36 0.2,37 3,38 7,39 16.291,40 18.578,41 8.96,42 8.558,44 5.301}
