{
  "data_features": {
    "feature": [
      {
        "data_type": "nominal",
        "index": "0",
        "is_ignore": "false",
        "is_row_identifier": "true",
        "is_target": "false",
        "name": "molecule_id",
        "nominal_value": [
          "CHEMBL1095992",
          "CHEMBL1095993",
          "CHEMBL1095994",
          "CHEMBL1241424",
          "CHEMBL1241425",
          "CHEMBL1241426",
          "CHEMBL1242922",
          "CHEMBL1243385",
          "CHEMBL1773083",
          "CHEMBL1774031",
          "CHEMBL1774154",
          "CHEMBL1774155",
          "CHEMBL1774156",
          "CHEMBL1774157",
          "CHEMBL1774158",
          "CHEMBL1774159",
          "CHEMBL1774160",
          "CHEMBL1774161",
          "CHEMBL1774162",
          "CHEMBL1774163",
          "CHEMBL1774164",
          "CHEMBL1774165",
          "CHEMBL1774166",
          "CHEMBL2063869",
          "CHEMBL2158051",
          "CHEMBL2158052",
          "CHEMBL2158053",
          "CHEMBL2158054",
          "CHEMBL2158599",
          "CHEMBL2158600",
          "CHEMBL2158601",
          "CHEMBL2158602",
          "CHEMBL2158603",
          "CHEMBL2158604",
          "CHEMBL2158605",
          "CHEMBL2158606",
          "CHEMBL2158607",
          "CHEMBL2311586",
          "CHEMBL2316213",
          "CHEMBL2316214",
          "CHEMBL2316215",
          "CHEMBL2316216",
          "CHEMBL2316217",
          "CHEMBL2316218",
          "CHEMBL2316219",
          "CHEMBL2316220",
          "CHEMBL2316221",
          "CHEMBL2316222",
          "CHEMBL2316223",
          "CHEMBL2316224",
          "CHEMBL2348613",
          "CHEMBL2348614",
          "CHEMBL2348615",
          "CHEMBL2348616",
          "CHEMBL2348617",
          "CHEMBL2348618",
          "CHEMBL2348619",
          "CHEMBL2348620",
          "CHEMBL2348621",
          "CHEMBL2348622",
          "CHEMBL2348623",
          "CHEMBL365059",
          "CHEMBL454988",
          "CHEMBL456400",
          "CHEMBL457092",
          "CHEMBL458791",
          "CHEMBL472832",
          "CHEMBL475670",
          "CHEMBL481213",
          "CHEMBL481421",
          "CHEMBL481422",
          "CHEMBL504559",
          "CHEMBL514738",
          "CHEMBL515347",
          "CHEMBL515848",
          "CHEMBL516172",
          "CHEMBL526858"
        ],
        "number_of_missing_values": "0"
      },
      {
        "data_type": "numeric",
        "index": "1",
        "is_ignore": "false",
        "is_row_identifier": "false",
        "is_target": "false",
        "name": "AMW",
        "number_of_missing_values": "0"
      },
      {
        "data_type": "numeric",
        "index": "2",
        "is_ignore": "false",
        "is_row_identifier": "false",
        "is_target": "false",
        "name": "C.",
        "number_of_missing_values": "0"
      },
      {
        "data_type": "numeric",
        "index": "3",
        "is_ignore": "false",
        "is_row_identifier": "false",
        "is_target": "true",
        "name": "pXC50",
        "number_of_missing_values": "0"
      }
    ]
  }
}