"molecule_id","AMW","C.","H.","Me","pXC50"
{1 6.384,2 32,3 54.7,4 1,5 7.266}
{0 CHEMBL129953,1 6.442,2 31.5,3 54.3,4 1.002,5 8.276}
{0 CHEMBL132409,1 6.698,2 31.1,3 52.5,4 1.007,5 9.046}
{0 CHEMBL132507,1 6.486,2 31.7,3 54,4 1.002,5 8.553}
{0 CHEMBL132524,1 6.603,2 31.3,3 53.1,4 1.005,5 9.108}
{0 CHEMBL132794,1 6.363,2 31.6,3 54.9,4 1,5 8.509}
{0 CHEMBL133340,1 6.576,2 31.7,3 53.3,4 1.004,5 8.456}
{0 CHEMBL133378,1 6.53,2 31.7,3 53.7,4 1.003,5 8.292}
{0 CHEMBL133798,1 6.402,2 31.5,3 54.6,4 1.001,5 8.495}
{0 CHEMBL133849,1 6.486,2 31.7,3 54,4 1.002,5 8.161}
{0 CHEMBL133850,1 6.443,2 31.8,3 54.3,4 1.001,5 8.456}
{0 CHEMBL172313,1 6.859,2 31,3 51.3,4 1.01,5 7.201}
{0 CHEMBL1766824,1 6.45,2 32.2,3 54.2,4 1.001,5 5.921}
{0 CHEMBL1766825,1 6.649,2 31.2,3 52.8,4 1.006,5 6.319}
{0 CHEMBL1766923,1 6.716,2 32.1,3 52.3,4 1.007,5 7.252}
{0 CHEMBL1766924,1 6.716,2 32.1,3 52.3,4 1.007,5 7.62}
{0 CHEMBL1766925,1 6.704,2 30.5,3 52.5,4 1.008,5 7.201}
{0 CHEMBL1766926,1 6.532,2 28.8,3 54.1,4 1.006,5 7.081}
{0 CHEMBL1766927,1 6.859,2 31,3 51.3,4 1.01,5 5.886}
{0 CHEMBL1766928,1 6.606,2 30.6,3 53.2,4 1.006,5 8.921}
{0 CHEMBL1766929,1 6.698,2 31.1,3 52.5,4 1.007,5 8.268}
{0 CHEMBL1766930,1 6.698,2 31.1,3 52.5,4 1.007,5 7.292}
{0 CHEMBL1766931,1 6.698,2 31.1,3 52.5,4 1.007,5 6.229}
{0 CHEMBL1766932,1 6.698,2 31.1,3 52.5,4 1.007,5 6.854}
{0 CHEMBL1766933,1 6.698,2 31.1,3 52.5,4 1.007,5 6.161}
{0 CHEMBL1766934,1 6.698,2 31.1,3 52.5,4 1.007,5 5.432}
{0 CHEMBL1766935,1 6.649,2 31.2,3 52.8,4 1.006,5 9.215}
{0 CHEMBL1766936,1 6.649,2 31.2,3 52.8,4 1.006,5 7.796}
{0 CHEMBL1766937,1 6.649,2 31.2,3 52.8,4 1.006,5 7.357}
{0 CHEMBL1766938,1 6.649,2 31.2,3 52.8,4 1.006,5 8.268}
{0 CHEMBL1766939,1 6.649,2 31.2,3 52.8,4 1.006,5 7.602}
{0 CHEMBL1766940,1 6.45,2 32.2,3 54.2,4 1.001,5 5.796}
{0 CHEMBL1766941,1 6.603,2 31.3,3 53.1,4 1.005,5 7.42}
{0 CHEMBL1766942,1 6.574,2 31.5,3 53.2,4 1.003,5 7.699}
{0 CHEMBL1766943,1 6.635,2 30.9,3 52.8,4 1.005,5 7}
{0 CHEMBL1766944,1 6.53,2 31.7,3 53.7,4 1.003,5 6.076}
{0 CHEMBL1766945,1 6.53,2 31.7,3 53.7,4 1.003,5 6.161}
{0 CHEMBL1766946,1 6.406,2 32.2,3 54.5,4 1,5 6.229}
{0 CHEMBL1766947,1 6.483,2 33.8,3 53.4,4 0.997,5 7.469}
{0 CHEMBL253527,1 6.649,2 31.2,3 52.8,4 1.006,5 7.77}
{0 CHEMBL254769,1 6.45,2 32.2,3 54.2,4 1.001,5 9.131}
{0 CHEMBL254770,1 6.45,2 32.2,3 54.2,4 1.001,5 6}
{0 CHEMBL258221,1 6.45,2 32.2,3 54.2,4 1.001,5 8.215}
{0 CHEMBL266230,1 6.649,2 31.2,3 52.8,4 1.006,5 6.678}
{0 CHEMBL335846,1 6.53,2 31.7,3 53.7,4 1.003,5 7.955}
{0 CHEMBL336836,1 6.603,2 31.3,3 53.1,4 1.005,5 9.523}
{0 CHEMBL337260,1 6.53,2 31.7,3 53.7,4 1.003,5 8.745}
{0 CHEMBL337644,1 6.53,2 31.7,3 53.7,4 1.003,5 9.155}
{0 CHEMBL337721,1 6.692,2 31.7,3 52.4,4 1.006,5 9.638}
{0 CHEMBL339139,1 6.625,2 31.6,3 53,4 1.005,5 8.523}
{0 CHEMBL342252,1 6.698,2 31.1,3 52.5,4 1.007,5 8.569}
{0 CHEMBL407196,1 6.972,2 32.5,3 50.4,4 1.012,5 6.959}
{0 CHEMBL411195,1 6.45,2 32.2,3 54.2,4 1.001,5 7.678}
{0 CHEMBL430910,1 6.576,2 31.7,3 53.3,4 1.004,5 8.678}
{0 CHEMBL434227,1 6.649,2 31.2,3 52.8,4 1.006,5 9.174}
{0 CHEMBL435199,1 6.557,2 32.5,3 53.2,4 1.001,5 6.301}
{0 CHEMBL439494,1 7.005,2 32.1,3 50.2,4 1.013,5 8.398}
