{
  "data_features": {
    "feature": [
      {
        "data_type": "nominal",
        "index": "0",
        "is_ignore": "false",
        "is_row_identifier": "true",
        "is_target": "false",
        "name": "molecule_id",
        "nominal_value": [
          "CHEMBL10",
          "CHEMBL101253",
          "CHEMBL103055",
          "CHEMBL103667",
          "CHEMBL105442",
          "CHEMBL106966",
          "CHEMBL1077979",
          "CHEMBL1080994",
          "CHEMBL1080995",
          "CHEMBL1082152",
          "CHEMBL1082440",
          "CHEMBL1084546",
          "CHEMBL1087421",
          "CHEMBL1087650",
          "CHEMBL1088633",
          "CHEMBL1089082",
          "CHEMBL1090356",
          "CHEMBL1090360",
          "CHEMBL1091356",
          "CHEMBL1092754",
          "CHEMBL1094408",
          "CHEMBL1095626",
          "CHEMBL1095627",
          "CHEMBL115220",
          "CHEMBL116070",
          "CHEMBL1163016",
          "CHEMBL1173055",
          "CHEMBL1173655",
          "CHEMBL117697",
          "CHEMBL1190711",
          "CHEMBL119385",
          "CHEMBL120077",
          "CHEMBL12131",
          "CHEMBL1230020",
          "CHEMBL1230122",
          "CHEMBL1230607",
          "CHEMBL1234833",
          "CHEMBL1236107",
          "CHEMBL1236126",
          "CHEMBL1240703",
          "CHEMBL1241473",
          "CHEMBL1241674",
          "CHEMBL1242373",
          "CHEMBL124660",
          "CHEMBL1258913",
          "CHEMBL1270230",
          "CHEMBL1270399",
          "CHEMBL1270795",
          "CHEMBL1272116",
          "CHEMBL1272171",
          "CHEMBL127898",
          "CHEMBL1287853",
          "CHEMBL1287886",
          "CHEMBL1288038",
          "CHEMBL1288039",
          "CHEMBL1288067",
          "CHEMBL1288069",
          "CHEMBL1288098",
          "CHEMBL1288099",
          "CHEMBL1288100",
          "CHEMBL1288127",
          "CHEMBL1288128",
          "CHEMBL1288129",
          "CHEMBL1288159",
          "CHEMBL1288160",
          "CHEMBL1288215",
          "CHEMBL1288895",
          "CHEMBL1289926",
          "CHEMBL1336",
          "CHEMBL1375418",
          "CHEMBL1375640",
          "CHEMBL1381197",
          "CHEMBL1406",
          "CHEMBL1419458",
          "CHEMBL1421",
          "CHEMBL143054",
          "CHEMBL1448",
          "CHEMBL1461728",
          "CHEMBL1466",
          "CHEMBL14762",
          "CHEMBL151430",
          "CHEMBL1516890",
          "CHEMBL1614701",
          "CHEMBL1614705",
          "CHEMBL1614820",
          "CHEMBL162",
          "CHEMBL1624529",
          "CHEMBL1644615",
          "CHEMBL1644617",
          "CHEMBL1644618",
          "CHEMBL1644619",
          "CHEMBL1644620",
          "CHEMBL1644621",
          "CHEMBL1644622",
          "CHEMBL1644623",
          "CHEMBL1644624",
          "CHEMBL1644625",
          "CHEMBL1644626",
          "CHEMBL1644627",
          "CHEMBL1644628",
          "CHEMBL1644629",
          "CHEMBL1644630",
          "CHEMBL1644631",
          "CHEMBL1644632",
          "CHEMBL1644633",
          "CHEMBL1644634",
          "CHEMBL1644635",
          "CHEMBL1644636",
          "CHEMBL1644638",
          "CHEMBL1644639",
          "CHEMBL1644640",
          "CHEMBL1644641",
          "CHEMBL1644642",
          "CHEMBL1644643",
          "CHEMBL1644646",
          "CHEMBL1650533",
          "CHEMBL1650545",
          "CHEMBL1650551",
          "CHEMBL1651521",
          "CHEMBL1651522",
          "CHEMBL1651523",
          "CHEMBL1668411",
          "CHEMBL1668418",
          "CHEMBL1668419",
          "CHEMBL1682007",
          "CHEMBL1682008",
          "CHEMBL1682009",
          "CHEMBL1682010",
          "CHEMBL1682011",
          "CHEMBL1682012",
          "CHEMBL1682013",
          "CHEMBL1682014",
          "CHEMBL1682015",
          "CHEMBL1682016",
          "CHEMBL1682017",
          "CHEMBL1682018",
          "CHEMBL1682019",
          "CHEMBL1682020",
          "CHEMBL1682021",
          "CHEMBL1682341",
          "CHEMBL1682345",
          "CHEMBL1682346",
          "CHEMBL1682357",
          "CHEMBL1682359",
          "CHEMBL1682360",
          "CHEMBL1682540",
          "CHEMBL1682545",
          "CHEMBL1682546",
          "CHEMBL1682552",
          "CHEMBL1682553",
          "CHEMBL1682558",
          "CHEMBL1684800",
          "CHEMBL1721885",
          "CHEMBL1727312",
          "CHEMBL17370",
          "CHEMBL1738710",
          "CHEMBL1738758",
          "CHEMBL1765781",
          "CHEMBL177688",
          "CHEMBL178737",
          "CHEMBL1789941",
          "CHEMBL180022",
          "CHEMBL1822138",
          "CHEMBL1822145",
          "CHEMBL1822146",
          "CHEMBL1822151",
          "CHEMBL1825138",
          "CHEMBL1834657",
          "CHEMBL183844",
          "CHEMBL184847",
          "CHEMBL185569",
          "CHEMBL18797",
          "CHEMBL188386",
          "CHEMBL188502",
          "CHEMBL1890036",
          "CHEMBL190710",
          "CHEMBL1908391",
          "CHEMBL1908392",
          "CHEMBL1908393",
          "CHEMBL1908394",
          "CHEMBL1908395",
          "CHEMBL1908396",
          "CHEMBL1908397",
          "CHEMBL1909070",
          "CHEMBL190984",
          "CHEMBL191003",
          "CHEMBL191336",
          "CHEMBL1916359",
          "CHEMBL192161",
          "CHEMBL1922114",
          "CHEMBL1922119",
          "CHEMBL1922120",
          "CHEMBL1922122",
          "CHEMBL1922123",
          "CHEMBL1922199",
          "CHEMBL1922204",
          "CHEMBL1922205",
          "CHEMBL1922208",
          "CHEMBL1922209",
          "CHEMBL1922210",
          "CHEMBL1922211",
          "CHEMBL1922212",
          "CHEMBL1922213",
          "CHEMBL1922214",
          "CHEMBL1922215",
          "CHEMBL1922217",
          "CHEMBL1929238",
          "CHEMBL1933552",
          "CHEMBL1933576",
          "CHEMBL1933582",
          "CHEMBL1945559",
          "CHEMBL195029",
          "CHEMBL1952210",
          "CHEMBL1958401",
          "CHEMBL196363",
          "CHEMBL1964290",
          "CHEMBL1964307",
          "CHEMBL1964399",
          "CHEMBL1964413",
          "CHEMBL1964444",
          "CHEMBL1964644",
          "CHEMBL1964687",
          "CHEMBL1964692",
          "CHEMBL1964777",
          "CHEMBL1964804",
          "CHEMBL1964937",
          "CHEMBL1965131",
          "CHEMBL1965351",
          "CHEMBL1965423",
          "CHEMBL1965495",
          "CHEMBL1965507",
          "CHEMBL1965570",
          "CHEMBL1965589",
          "CHEMBL1965631",
          "CHEMBL1965660",
          "CHEMBL1965836",
          "CHEMBL1965845",
          "CHEMBL1965910",
          "CHEMBL1965988",
          "CHEMBL1966035",
          "CHEMBL1966069",
          "CHEMBL1966087",
          "CHEMBL1966279",
          "CHEMBL1966343",
          "CHEMBL1966425",
          "CHEMBL1966514",
          "CHEMBL1966524",
          "CHEMBL1966628",
          "CHEMBL1966703",
          "CHEMBL1966722",
          "CHEMBL1966808",
          "CHEMBL1966816",
          "CHEMBL1967094",
          "CHEMBL1967116",
          "CHEMBL1967302",
          "CHEMBL1967531",
          "CHEMBL1967544",
          "CHEMBL1967564",
          "CHEMBL1967720",
          "CHEMBL1967878",
          "CHEMBL1967887",
          "CHEMBL1968070",
          "CHEMBL1968127",
          "CHEMBL1968151",
          "CHEMBL1968245",
          "CHEMBL1968380",
          "CHEMBL1968406",
          "CHEMBL1968590",
          "CHEMBL1968705",
          "CHEMBL1968791",
          "CHEMBL1968850",
          "CHEMBL1968926",
          "CHEMBL1969042",
          "CHEMBL1969049",
          "CHEMBL1969102",
          "CHEMBL1969126",
          "CHEMBL1969190",
          "CHEMBL1969264",
          "CHEMBL1969301",
          "CHEMBL1969372",
          "CHEMBL1969502",
          "CHEMBL1969506",
          "CHEMBL1969523",
          "CHEMBL1969537",
          "CHEMBL1969588",
          "CHEMBL1969664",
          "CHEMBL1969735",
          "CHEMBL1969755",
          "CHEMBL1969843",
          "CHEMBL1969879",
          "CHEMBL1970006",
          "CHEMBL1970074",
          "CHEMBL1970083",
          "CHEMBL1970104",
          "CHEMBL1970142",
          "CHEMBL1970189",
          "CHEMBL1970203",
          "CHEMBL1970217",
          "CHEMBL1970314",
          "CHEMBL1970317",
          "CHEMBL1970340",
          "CHEMBL1970369",
          "CHEMBL1970522",
          "CHEMBL1970709",
          "CHEMBL1970735",
          "CHEMBL1970806",
          "CHEMBL1970879",
          "CHEMBL1970903",
          "CHEMBL1970913",
          "CHEMBL1971017",
          "CHEMBL1971021",
          "CHEMBL1971029",
          "CHEMBL1971141",
          "CHEMBL1971149",
          "CHEMBL1971186",
          "CHEMBL1971245",
          "CHEMBL1971430",
          "CHEMBL1971649",
          "CHEMBL1971694",
          "CHEMBL1971801",
          "CHEMBL1971943",
          "CHEMBL1971947",
          "CHEMBL1972119",
          "CHEMBL1972125",
          "CHEMBL1972142",
          "CHEMBL1972152",
          "CHEMBL1972158",
          "CHEMBL1972183",
          "CHEMBL1972221",
          "CHEMBL1972250",
          "CHEMBL1972258",
          "CHEMBL1972276",
          "CHEMBL1972362",
          "CHEMBL1972489",
          "CHEMBL1972568",
          "CHEMBL1972576",
          "CHEMBL1972584",
          "CHEMBL1972659",
          "CHEMBL1972820",
          "CHEMBL1972840",
          "CHEMBL1972849",
          "CHEMBL1972937",
          "CHEMBL1973098",
          "CHEMBL1973142",
          "CHEMBL1973145",
          "CHEMBL1973211",
          "CHEMBL1973348",
          "CHEMBL1973395",
          "CHEMBL1973483",
          "CHEMBL1973540",
          "CHEMBL1973711",
          "CHEMBL1973808",
          "CHEMBL1973860",
          "CHEMBL1973893",
          "CHEMBL1973937",
          "CHEMBL1974254",
          "CHEMBL1974288",
          "CHEMBL1974310",
          "CHEMBL1974328",
          "CHEMBL1974416",
          "CHEMBL1974457",
          "CHEMBL1974664",
          "CHEMBL1974702",
          "CHEMBL1974803",
          "CHEMBL1974870",
          "CHEMBL1974935",
          "CHEMBL1975121",
          "CHEMBL1975138",
          "CHEMBL1975208",
          "CHEMBL1975233",
          "CHEMBL1975256",
          "CHEMBL1975357",
          "CHEMBL1975418",
          "CHEMBL1975490",
          "CHEMBL1975500",
          "CHEMBL1975534",
          "CHEMBL1975647",
          "CHEMBL1975787",
          "CHEMBL1975900",
          "CHEMBL1976090",
          "CHEMBL1976093",
          "CHEMBL1976134",
          "CHEMBL1976220",
          "CHEMBL1976240",
          "CHEMBL1976328",
          "CHEMBL1976420",
          "CHEMBL1976455",
          "CHEMBL1976732",
          "CHEMBL1977041",
          "CHEMBL1977135",
          "CHEMBL1977148",
          "CHEMBL1977223",
          "CHEMBL1977346",
          "CHEMBL1977374",
          "CHEMBL1977604",
          "CHEMBL1977681",
          "CHEMBL1977713",
          "CHEMBL1977814",
          "CHEMBL1978014",
          "CHEMBL1978099",
          "CHEMBL1978200",
          "CHEMBL1978448",
          "CHEMBL1978656",
          "CHEMBL1979057",
          "CHEMBL1979093",
          "CHEMBL1979176",
          "CHEMBL1979252",
          "CHEMBL1979318",
          "CHEMBL1979357",
          "CHEMBL1979516",
          "CHEMBL1979554",
          "CHEMBL1979577",
          "CHEMBL1979718",
          "CHEMBL1979855",
          "CHEMBL1979883",
          "CHEMBL1979970",
          "CHEMBL1980142",
          "CHEMBL1980144",
          "CHEMBL1980163",
          "CHEMBL1980297",
          "CHEMBL1980391",
          "CHEMBL1980489",
          "CHEMBL1980540",
          "CHEMBL1980704",
          "CHEMBL1980715",
          "CHEMBL1980802",
          "CHEMBL1980896",
          "CHEMBL1980995",
          "CHEMBL1981045",
          "CHEMBL1981047",
          "CHEMBL1981079",
          "CHEMBL1981410",
          "CHEMBL1981725",
          "CHEMBL1981782",
          "CHEMBL1982122",
          "CHEMBL1982135",
          "CHEMBL1982167",
          "CHEMBL1982361",
          "CHEMBL1982383",
          "CHEMBL1982465",
          "CHEMBL1982466",
          "CHEMBL1982476",
          "CHEMBL1982506",
          "CHEMBL1982563",
          "CHEMBL1982610",
          "CHEMBL1982660",
          "CHEMBL1982711",
          "CHEMBL1982866",
          "CHEMBL1982874",
          "CHEMBL1982880",
          "CHEMBL1982924",
          "CHEMBL1982957",
          "CHEMBL1982980",
          "CHEMBL1982992",
          "CHEMBL1983006",
          "CHEMBL1983025",
          "CHEMBL1983111",
          "CHEMBL1983195",
          "CHEMBL1983309",
          "CHEMBL1983449",
          "CHEMBL1983534",
          "CHEMBL1983923",
          "CHEMBL1983932",
          "CHEMBL1983945",
          "CHEMBL1983963",
          "CHEMBL1984038",
          "CHEMBL1984039",
          "CHEMBL1984044",
          "CHEMBL1984191",
          "CHEMBL1984206",
          "CHEMBL1984274",
          "CHEMBL1984363",
          "CHEMBL1984367",
          "CHEMBL1984432",
          "CHEMBL1984541",
          "CHEMBL1984586",
          "CHEMBL1984633",
          "CHEMBL1984700",
          "CHEMBL1984711",
          "CHEMBL1984788",
          "CHEMBL1984842",
          "CHEMBL1985074",
          "CHEMBL1985092",
          "CHEMBL1985095",
          "CHEMBL1985311",
          "CHEMBL1985406",
          "CHEMBL1985566",
          "CHEMBL1985580",
          "CHEMBL1986139",
          "CHEMBL1986186",
          "CHEMBL1986263",
          "CHEMBL1986328",
          "CHEMBL1986499",
          "CHEMBL1986530",
          "CHEMBL1986597",
          "CHEMBL1986603",
          "CHEMBL1986781",
          "CHEMBL1986869",
          "CHEMBL1986943",
          "CHEMBL1986970",
          "CHEMBL1987007",
          "CHEMBL1987009",
          "CHEMBL1987034",
          "CHEMBL1987054",
          "CHEMBL1987359",
          "CHEMBL1987533",
          "CHEMBL1987648",
          "CHEMBL1987679",
          "CHEMBL1987756",
          "CHEMBL1987793",
          "CHEMBL1987910",
          "CHEMBL1987982",
          "CHEMBL1988075",
          "CHEMBL1988153",
          "CHEMBL1988163",
          "CHEMBL1988173",
          "CHEMBL1988300",
          "CHEMBL1988370",
          "CHEMBL1988387",
          "CHEMBL1988437",
          "CHEMBL1988537",
          "CHEMBL1988594",
          "CHEMBL1988608",
          "CHEMBL1988717",
          "CHEMBL1988838",
          "CHEMBL1988995",
          "CHEMBL1989029",
          "CHEMBL1989265",
          "CHEMBL1989474",
          "CHEMBL1989518",
          "CHEMBL1989646",
          "CHEMBL1989708",
          "CHEMBL1989805",
          "CHEMBL1989856",
          "CHEMBL1989957",
          "CHEMBL1990212",
          "CHEMBL1990254",
          "CHEMBL1990288",
          "CHEMBL1990346",
          "CHEMBL1990415",
          "CHEMBL1990482",
          "CHEMBL1990496",
          "CHEMBL1990583",
          "CHEMBL1990821",
          "CHEMBL1990884",
          "CHEMBL1990885",
          "CHEMBL1990904",
          "CHEMBL1990912",
          "CHEMBL1991063",
          "CHEMBL1991078",
          "CHEMBL1991138",
          "CHEMBL1991143",
          "CHEMBL1991180",
          "CHEMBL1991188",
          "CHEMBL1991285",
          "CHEMBL1991356",
          "CHEMBL1991395",
          "CHEMBL1991429",
          "CHEMBL1991434",
          "CHEMBL1991577",
          "CHEMBL1991640",
          "CHEMBL1991674",
          "CHEMBL1991725",
          "CHEMBL1991728",
          "CHEMBL1991800",
          "CHEMBL1991846",
          "CHEMBL1992242",
          "CHEMBL1992306",
          "CHEMBL1992323",
          "CHEMBL1992342",
          "CHEMBL1992536",
          "CHEMBL1992555",
          "CHEMBL1992634",
          "CHEMBL1992645",
          "CHEMBL1992732",
          "CHEMBL1992740",
          "CHEMBL1992796",
          "CHEMBL1992922",
          "CHEMBL1992937",
          "CHEMBL1993166",
          "CHEMBL1993243",
          "CHEMBL1993424",
          "CHEMBL1993548",
          "CHEMBL1993584",
          "CHEMBL1993661",
          "CHEMBL1993722",
          "CHEMBL1993781",
          "CHEMBL1993941",
          "CHEMBL199395",
          "CHEMBL1994040",
          "CHEMBL1994074",
          "CHEMBL1994241",
          "CHEMBL1994321",
          "CHEMBL1994361",
          "CHEMBL1994526",
          "CHEMBL1994538",
          "CHEMBL1994693",
          "CHEMBL1994830",
          "CHEMBL1994864",
          "CHEMBL1994938",
          "CHEMBL1995172",
          "CHEMBL1995448",
          "CHEMBL1995592",
          "CHEMBL1995736",
          "CHEMBL1995813",
          "CHEMBL1995832",
          "CHEMBL1995927",
          "CHEMBL1996066",
          "CHEMBL1996111",
          "CHEMBL1996155",
          "CHEMBL1996208",
          "CHEMBL1996234",
          "CHEMBL1996390",
          "CHEMBL1996500",
          "CHEMBL1996543",
          "CHEMBL1996587",
          "CHEMBL1996780",
          "CHEMBL1996791",
          "CHEMBL1996817",
          "CHEMBL1996831",
          "CHEMBL1996923",
          "CHEMBL1996931",
          "CHEMBL1996979",
          "CHEMBL1997023",
          "CHEMBL1997025",
          "CHEMBL1997129",
          "CHEMBL1997340",
          "CHEMBL1997349",
          "CHEMBL1997503",
          "CHEMBL1997534",
          "CHEMBL1997597",
          "CHEMBL1997617",
          "CHEMBL1997623",
          "CHEMBL1997759",
          "CHEMBL1997764",
          "CHEMBL1997822",
          "CHEMBL1997846",
          "CHEMBL1997872",
          "CHEMBL1998112",
          "CHEMBL1998121",
          "CHEMBL1998159",
          "CHEMBL1998193",
          "CHEMBL1998414",
          "CHEMBL1998435",
          "CHEMBL1998545",
          "CHEMBL1998551",
          "CHEMBL1998585",
          "CHEMBL1998611",
          "CHEMBL1998829",
          "CHEMBL1999112",
          "CHEMBL1999126",
          "CHEMBL1999321",
          "CHEMBL1999428",
          "CHEMBL1999496",
          "CHEMBL1999556",
          "CHEMBL1999590",
          "CHEMBL1999714",
          "CHEMBL1999718",
          "CHEMBL1999749",
          "CHEMBL1999774",
          "CHEMBL1999811",
          "CHEMBL1999918",
          "CHEMBL1999931",
          "CHEMBL2000071",
          "CHEMBL2000104",
          "CHEMBL2000114",
          "CHEMBL2000271",
          "CHEMBL2000335",
          "CHEMBL2000345",
          "CHEMBL2000354",
          "CHEMBL2000393",
          "CHEMBL2000408",
          "CHEMBL2000429",
          "CHEMBL2000433",
          "CHEMBL2000481",
          "CHEMBL2000508",
          "CHEMBL2000568",
          "CHEMBL2000685",
          "CHEMBL2000801",
          "CHEMBL2000832",
          "CHEMBL2000894",
          "CHEMBL2001224",
          "CHEMBL2001239",
          "CHEMBL2001257",
          "CHEMBL2001288",
          "CHEMBL2001485",
          "CHEMBL2001547",
          "CHEMBL2001668",
          "CHEMBL2001751",
          "CHEMBL2001920",
          "CHEMBL2001923",
          "CHEMBL2001957",
          "CHEMBL2001998",
          "CHEMBL2002165",
          "CHEMBL2002240",
          "CHEMBL2002322",
          "CHEMBL2002323",
          "CHEMBL2002373",
          "CHEMBL2002407",
          "CHEMBL2002446",
          "CHEMBL2002479",
          "CHEMBL2002553",
          "CHEMBL2002649",
          "CHEMBL2002682",
          "CHEMBL2002702",
          "CHEMBL2002726",
          "CHEMBL2003271",
          "CHEMBL2003286",
          "CHEMBL2003341",
          "CHEMBL2003420",
          "CHEMBL2003456",
          "CHEMBL2003482",
          "CHEMBL2003524",
          "CHEMBL2003638",
          "CHEMBL2003657",
          "CHEMBL2003768",
          "CHEMBL2003817",
          "CHEMBL2004072",
          "CHEMBL2004290",
          "CHEMBL2004311",
          "CHEMBL2004355",
          "CHEMBL2004365",
          "CHEMBL2004419",
          "CHEMBL2004438",
          "CHEMBL2004447",
          "CHEMBL2004513",
          "CHEMBL2004544",
          "CHEMBL2004615",
          "CHEMBL2004647",
          "CHEMBL2004692",
          "CHEMBL2004716",
          "CHEMBL2004771",
          "CHEMBL2004871",
          "CHEMBL2004872",
          "CHEMBL2004892",
          "CHEMBL2004934",
          "CHEMBL2005112",
          "CHEMBL2005186",
          "CHEMBL2005375",
          "CHEMBL2005475",
          "CHEMBL2005528",
          "CHEMBL2005548",
          "CHEMBL2005631",
          "CHEMBL2005792",
          "CHEMBL2005828",
          "CHEMBL2005886",
          "CHEMBL2005899",
          "CHEMBL2005936",
          "CHEMBL2006010",
          "CHEMBL2006156",
          "CHEMBL2006188",
          "CHEMBL2006237",
          "CHEMBL2006263",
          "CHEMBL2006276",
          "CHEMBL2006439",
          "CHEMBL2006481",
          "CHEMBL2006493",
          "CHEMBL2006567",
          "CHEMBL2006580",
          "CHEMBL2006581",
          "CHEMBL2006631",
          "CHEMBL2006715",
          "CHEMBL2006778",
          "CHEMBL2006785",
          "CHEMBL2006836",
          "CHEMBL2006933",
          "CHEMBL2007002",
          "CHEMBL2007044",
          "CHEMBL2007064",
          "CHEMBL2007151",
          "CHEMBL2007296",
          "CHEMBL2007372",
          "CHEMBL2007592",
          "CHEMBL2012519",
          "CHEMBL202635",
          "CHEMBL2029988",
          "CHEMBL2036343",
          "CHEMBL204420",
          "CHEMBL2064628",
          "CHEMBL206783",
          "CHEMBL206955",
          "CHEMBL207037",
          "CHEMBL207130",
          "CHEMBL207228",
          "CHEMBL207235",
          "CHEMBL207246",
          "CHEMBL207253",
          "CHEMBL207400",
          "CHEMBL207445",
          "CHEMBL207544",
          "CHEMBL207584",
          "CHEMBL207674",
          "CHEMBL207687",
          "CHEMBL207718",
          "CHEMBL207815",
          "CHEMBL207995",
          "CHEMBL208048",
          "CHEMBL208118",
          "CHEMBL208286",
          "CHEMBL208292",
          "CHEMBL208637",
          "CHEMBL209534",
          "CHEMBL210032",
          "CHEMBL210390",
          "CHEMBL210618",
          "CHEMBL210887",
          "CHEMBL210928",
          "CHEMBL210963",
          "CHEMBL211003",
          "CHEMBL211378",
          "CHEMBL211501",
          "CHEMBL212382",
          "CHEMBL212968",
          "CHEMBL213423",
          "CHEMBL213451",
          "CHEMBL213505",
          "CHEMBL214198",
          "CHEMBL215152",
          "CHEMBL215652",
          "CHEMBL215803",
          "CHEMBL2178352",
          "CHEMBL219627",
          "CHEMBL219683",
          "CHEMBL219722",
          "CHEMBL219790",
          "CHEMBL219841",
          "CHEMBL219849",
          "CHEMBL219988",
          "CHEMBL220054",
          "CHEMBL220057",
          "CHEMBL220096",
          "CHEMBL220110",
          "CHEMBL220112",
          "CHEMBL220169",
          "CHEMBL220174",
          "CHEMBL220241",
          "CHEMBL220272",
          "CHEMBL220320",
          "CHEMBL220343",
          "CHEMBL2205426",
          "CHEMBL220574",
          "CHEMBL2205766",
          "CHEMBL2206242",
          "CHEMBL220882",
          "CHEMBL220888",
          "CHEMBL220897",
          "CHEMBL221096",
          "CHEMBL221109",
          "CHEMBL221117",
          "CHEMBL221271",
          "CHEMBL221959",
          "CHEMBL222249",
          "CHEMBL222465",
          "CHEMBL222841",
          "CHEMBL223257",
          "CHEMBL223360",
          "CHEMBL223367",
          "CHEMBL223460",
          "CHEMBL223471",
          "CHEMBL225519",
          "CHEMBL226403",
          "CHEMBL226471",
          "CHEMBL230011",
          "CHEMBL2309006",
          "CHEMBL2309609",
          "CHEMBL231209",
          "CHEMBL2312290",
          "CHEMBL2312301",
          "CHEMBL2312303",
          "CHEMBL2312304",
          "CHEMBL2312645",
          "CHEMBL2312646",
          "CHEMBL2312649",
          "CHEMBL2312652",
          "CHEMBL2312654",
          "CHEMBL232599",
          "CHEMBL232600",
          "CHEMBL232601",
          "CHEMBL232610",
          "CHEMBL2333365",
          "CHEMBL233794",
          "CHEMBL2338333",
          "CHEMBL2338334",
          "CHEMBL2338335",
          "CHEMBL235345",
          "CHEMBL242237",
          "CHEMBL242753",
          "CHEMBL243088",
          "CHEMBL244378",
          "CHEMBL245884",
          "CHEMBL246088",
          "CHEMBL246089",
          "CHEMBL246970",
          "CHEMBL247250",
          "CHEMBL247619",
          "CHEMBL247797",
          "CHEMBL247798",
          "CHEMBL24828",
          "CHEMBL248757",
          "CHEMBL249282",
          "CHEMBL24944",
          "CHEMBL249697",
          "CHEMBL253969",
          "CHEMBL255465",
          "CHEMBL255863",
          "CHEMBL256835",
          "CHEMBL257834",
          "CHEMBL259084",
          "CHEMBL259551",
          "CHEMBL259850",
          "CHEMBL259922",
          "CHEMBL260092",
          "CHEMBL260135",
          "CHEMBL261849",
          "CHEMBL262433",
          "CHEMBL262615",
          "CHEMBL271381",
          "CHEMBL272453",
          "CHEMBL274064",
          "CHEMBL278041",
          "CHEMBL280074",
          "CHEMBL288441",
          "CHEMBL290106",
          "CHEMBL291338",
          "CHEMBL296468",
          "CHEMBL296586",
          "CHEMBL296682",
          "CHEMBL298445",
          "CHEMBL300138",
          "CHEMBL302449",
          "CHEMBL306380",
          "CHEMBL316264",
          "CHEMBL319244",
          "CHEMBL31965",
          "CHEMBL323336",
          "CHEMBL326282",
          "CHEMBL332551",
          "CHEMBL336961",
          "CHEMBL340384",
          "CHEMBL340921",
          "CHEMBL35482",
          "CHEMBL356164",
          "CHEMBL357047",
          "CHEMBL359106",
          "CHEMBL361708",
          "CHEMBL362558",
          "CHEMBL363555",
          "CHEMBL363648",
          "CHEMBL364953",
          "CHEMBL365847",
          "CHEMBL369976",
          "CHEMBL370379",
          "CHEMBL371169",
          "CHEMBL371206",
          "CHEMBL372657",
          "CHEMBL373448",
          "CHEMBL373598",
          "CHEMBL373628",
          "CHEMBL373646",
          "CHEMBL373797",
          "CHEMBL374677",
          "CHEMBL374876",
          "CHEMBL375284",
          "CHEMBL375525",
          "CHEMBL375544",
          "CHEMBL375621",
          "CHEMBL376967",
          "CHEMBL377300",
          "CHEMBL377383",
          "CHEMBL377408",
          "CHEMBL377772",
          "CHEMBL378370",
          "CHEMBL378627",
          "CHEMBL378963",
          "CHEMBL379218",
          "CHEMBL379601",
          "CHEMBL379835",
          "CHEMBL379849",
          "CHEMBL379905",
          "CHEMBL379929",
          "CHEMBL38",
          "CHEMBL380006",
          "CHEMBL380386",
          "CHEMBL380454",
          "CHEMBL380889",
          "CHEMBL380946",
          "CHEMBL382638",
          "CHEMBL382822",
          "CHEMBL382823",
          "CHEMBL383104",
          "CHEMBL383172",
          "CHEMBL383246",
          "CHEMBL383264",
          "CHEMBL383541",
          "CHEMBL383760",
          "CHEMBL38380",
          "CHEMBL384304",
          "CHEMBL386051",
          "CHEMBL387385",
          "CHEMBL387971",
          "CHEMBL388590",
          "CHEMBL389745",
          "CHEMBL391655",
          "CHEMBL391656",
          "CHEMBL392642",
          "CHEMBL393929",
          "CHEMBL394619",
          "CHEMBL394790",
          "CHEMBL395080",
          "CHEMBL395157",
          "CHEMBL396377",
          "CHEMBL396523",
          "CHEMBL397332",
          "CHEMBL397591",
          "CHEMBL398601",
          "CHEMBL398951",
          "CHEMBL402548",
          "CHEMBL402846",
          "CHEMBL404367",
          "CHEMBL406375",
          "CHEMBL408",
          "CHEMBL411903",
          "CHEMBL412142",
          "CHEMBL413779",
          "CHEMBL41783",
          "CHEMBL421",
          "CHEMBL422897",
          "CHEMBL424872",
          "CHEMBL425601",
          "CHEMBL425904",
          "CHEMBL428690",
          "CHEMBL437747",
          "CHEMBL437885",
          "CHEMBL437943",
          "CHEMBL438485",
          "CHEMBL440084",
          "CHEMBL440356",
          "CHEMBL443962",
          "CHEMBL445178",
          "CHEMBL445813",
          "CHEMBL450786",
          "CHEMBL451964",
          "CHEMBL454617",
          "CHEMBL455389",
          "CHEMBL455641",
          "CHEMBL458997",
          "CHEMBL461139",
          "CHEMBL461140",
          "CHEMBL462120",
          "CHEMBL463119",
          "CHEMBL464552",
          "CHEMBL466496",
          "CHEMBL467079",
          "CHEMBL468125",
          "CHEMBL468280",
          "CHEMBL474432",
          "CHEMBL475251",
          "CHEMBL477772",
          "CHEMBL477817",
          "CHEMBL481248",
          "CHEMBL481491",
          "CHEMBL482767",
          "CHEMBL482967",
          "CHEMBL483158",
          "CHEMBL483321",
          "CHEMBL484390",
          "CHEMBL485556",
          "CHEMBL486540",
          "CHEMBL486541",
          "CHEMBL487153",
          "CHEMBL487154",
          "CHEMBL487356",
          "CHEMBL491473",
          "CHEMBL494089",
          "CHEMBL494221",
          "CHEMBL496",
          "CHEMBL497151",
          "CHEMBL504950",
          "CHEMBL506247",
          "CHEMBL507666",
          "CHEMBL507936",
          "CHEMBL508928",
          "CHEMBL50894",
          "CHEMBL509",
          "CHEMBL509032",
          "CHEMBL511410",
          "CHEMBL513846",
          "CHEMBL513909",
          "CHEMBL514499",
          "CHEMBL519113",
          "CHEMBL519697",
          "CHEMBL520871",
          "CHEMBL520882",
          "CHEMBL521851",
          "CHEMBL522892",
          "CHEMBL523823",
          "CHEMBL52387",
          "CHEMBL524266",
          "CHEMBL525191",
          "CHEMBL526133",
          "CHEMBL535",
          "CHEMBL535331",
          "CHEMBL536151",
          "CHEMBL539474",
          "CHEMBL547",
          "CHEMBL549385",
          "CHEMBL551140",
          "CHEMBL553",
          "CHEMBL554",
          "CHEMBL554060",
          "CHEMBL557003",
          "CHEMBL557012",
          "CHEMBL558752",
          "CHEMBL559687",
          "CHEMBL559885",
          "CHEMBL560813",
          "CHEMBL561708",
          "CHEMBL563057",
          "CHEMBL564389",
          "CHEMBL564447",
          "CHEMBL564829",
          "CHEMBL565286",
          "CHEMBL565459",
          "CHEMBL565460",
          "CHEMBL565612",
          "CHEMBL568483",
          "CHEMBL568937",
          "CHEMBL569181",
          "CHEMBL569869",
          "CHEMBL569880",
          "CHEMBL570111",
          "CHEMBL570366",
          "CHEMBL570367",
          "CHEMBL571030",
          "CHEMBL571031",
          "CHEMBL571038",
          "CHEMBL571040",
          "CHEMBL571056",
          "CHEMBL571484",
          "CHEMBL571722",
          "CHEMBL572157",
          "CHEMBL572162",
          "CHEMBL572361",
          "CHEMBL572878",
          "CHEMBL572881",
          "CHEMBL573339",
          "CHEMBL574646",
          "CHEMBL574738",
          "CHEMBL576048",
          "CHEMBL576683",
          "CHEMBL576982",
          "CHEMBL577193",
          "CHEMBL582829",
          "CHEMBL583042",
          "CHEMBL583144",
          "CHEMBL584754",
          "CHEMBL590109",
          "CHEMBL591325",
          "CHEMBL592030",
          "CHEMBL597754",
          "CHEMBL599224",
          "CHEMBL599428",
          "CHEMBL601719",
          "CHEMBL603",
          "CHEMBL604712",
          "CHEMBL606245",
          "CHEMBL606964",
          "CHEMBL607707",
          "CHEMBL608154",
          "CHEMBL7064",
          "CHEMBL75680",
          "CHEMBL77155",
          "CHEMBL86754",
          "CHEMBL91829",
          "CHEMBL93645",
          "CHEMBL939",
          "CHEMBL941",
          "CHEMBL95692",
          "CHEMBL99203",
          "CHEMBL99743"
        ],
        "number_of_missing_values": "0"
      },
      {
        "data_type": "numeric",
        "index": "1",
        "is_ignore": "false",
        "is_row_identifier": "false",
        "is_target": "false",
        "name": "CATS2D_06_DD",
        "number_of_missing_values": "0"
      },
      {
        "data_type": "numeric",
        "index": "2",
        "is_ignore": "false",
        "is_row_identifier": "false",
        "is_target": "false",
        "name": "D.Dtr10",
        "number_of_missing_values": "0"
      },
      {
        "data_type": "numeric",
        "index": "3",
        "is_ignore": "false",
        "is_row_identifier": "false",
        "is_target": "false",
        "name": "CATS2D_03_DD",
        "number_of_missing_values": "0"
      },
      {
        "data_type": "numeric",
        "index": "4",
        "is_ignore": "false",
        "is_row_identifier": "false",
        "is_target": "false",
        "name": "C.042",
        "number_of_missing_values": "0"
      },
      {
        "data_type": "numeric",
        "index": "5",
        "is_ignore": "false",
        "is_row_identifier": "false",
        "is_target": "false",
        "name": "SpMin1_Bh.s.",
        "number_of_missing_values": "0"
      },
      {
        "data_type": "numeric",
        "index": "6",
        "is_ignore": "false",
        "is_row_identifier": "false",
        "is_target": "false",
        "name": "nPyrroles",
        "number_of_missing_values": "0"
      },
      {
        "data_type": "numeric",
        "index": "7",
        "is_ignore": "false",
        "is_row_identifier": "false",
        "is_target": "false",
        "name": "N.073",
        "number_of_missing_values": "0"
      },
      {
        "data_type": "numeric",
        "index": "8",
        "is_ignore": "false",
        "is_row_identifier": "false",
        "is_target": "false",
        "name": "SpMin1_Bh.v.",
        "number_of_missing_values": "0"
      },
      {
        "data_type": "numeric",
        "index": "9",
        "is_ignore": "false",
        "is_row_identifier": "false",
        "is_target": "false",
        "name": "SaaNH",
        "number_of_missing_values": "0"
      },
      {
        "data_type": "numeric",
        "index": "10",
        "is_ignore": "false",
        "is_row_identifier": "false",
        "is_target": "false",
        "name": "nArCONHR",
        "number_of_missing_values": "0"
      },
      {
        "data_type": "numeric",
        "index": "11",
        "is_ignore": "false",
        "is_row_identifier": "false",
        "is_target": "false",
        "name": "Chi1_EA.dm.",
        "number_of_missing_values": "0"
      },
      {
        "data_type": "numeric",
        "index": "12",
        "is_ignore": "false",
        "is_row_identifier": "false",
        "is_target": "false",
        "name": "SpMin1_Bh.m.",
        "number_of_missing_values": "0"
      },
      {
        "data_type": "numeric",
        "index": "13",
        "is_ignore": "false",
        "is_row_identifier": "false",
        "is_target": "false",
        "name": "GATS1i",
        "number_of_missing_values": "0"
      },
      {
        "data_type": "numeric",
        "index": "14",
        "is_ignore": "false",
        "is_row_identifier": "false",
        "is_target": "false",
        "name": "C.008",
        "number_of_missing_values": "0"
      },
      {
        "data_type": "numeric",
        "index": "15",
        "is_ignore": "false",
        "is_row_identifier": "false",
        "is_target": "false",
        "name": "MATS1v",
        "number_of_missing_values": "0"
      },
      {
        "data_type": "numeric",
        "index": "16",
        "is_ignore": "false",
        "is_row_identifier": "false",
        "is_target": "false",
        "name": "MATS4e",
        "number_of_missing_values": "0"
      },
      {
        "data_type": "numeric",
        "index": "17",
        "is_ignore": "false",
        "is_row_identifier": "false",
        "is_target": "false",
        "name": "SsssN",
        "number_of_missing_values": "0"
      },
      {
        "data_type": "numeric",
        "index": "18",
        "is_ignore": "false",
        "is_row_identifier": "false",
        "is_target": "false",
        "name": "NaaNH",
        "number_of_missing_values": "0"
      },
      {
        "data_type": "numeric",
        "index": "19",
        "is_ignore": "false",
        "is_row_identifier": "false",
        "is_target": "false",
        "name": "NsssN",
        "number_of_missing_values": "0"
      },
      {
        "data_type": "numeric",
        "index": "20",
        "is_ignore": "false",
        "is_row_identifier": "false",
        "is_target": "false",
        "name": "Chi0_EA.dm.",
        "number_of_missing_values": "0"
      },
      {
        "data_type": "numeric",
        "index": "21",
        "is_ignore": "false",
        "is_row_identifier": "false",
        "is_target": "false",
        "name": "SpDiam_EA.dm.",
        "number_of_missing_values": "0"
      },
      {
        "data_type": "numeric",
        "index": "22",
        "is_ignore": "false",
        "is_row_identifier": "false",
        "is_target": "false",
        "name": "SM10_EA.dm.",
        "number_of_missing_values": "0"
      },
      {
        "data_type": "numeric",
        "index": "23",
        "is_ignore": "false",
        "is_row_identifier": "false",
        "is_target": "false",
        "name": "SpMin1_Bh.p.",
        "number_of_missing_values": "0"
      },
      {
        "data_type": "numeric",
        "index": "24",
        "is_ignore": "false",
        "is_row_identifier": "false",
        "is_target": "false",
        "name": "NsssCH",
        "number_of_missing_values": "0"
      },
      {
        "data_type": "numeric",
        "index": "25",
        "is_ignore": "false",
        "is_row_identifier": "false",
        "is_target": "false",
        "name": "MATS1p",
        "number_of_missing_values": "0"
      },
      {
        "data_type": "numeric",
        "index": "26",
        "is_ignore": "false",
        "is_row_identifier": "false",
        "is_target": "false",
        "name": "nN.C.N.",
        "number_of_missing_values": "0"
      },
      {
        "data_type": "numeric",
        "index": "27",
        "is_ignore": "false",
        "is_row_identifier": "false",
        "is_target": "false",
        "name": "nR10",
        "number_of_missing_values": "0"
      },
      {
        "data_type": "numeric",
        "index": "28",
        "is_ignore": "false",
        "is_row_identifier": "false",
        "is_target": "false",
        "name": "Eig01_AEA.bo.",
        "number_of_missing_values": "0"
      },
      {
        "data_type": "numeric",
        "index": "29",
        "is_ignore": "false",
        "is_row_identifier": "false",
        "is_target": "false",
        "name": "SpMax_AEA.bo.",
        "number_of_missing_values": "0"
      },
      {
        "data_type": "numeric",
        "index": "30",
        "is_ignore": "false",
        "is_row_identifier": "false",
        "is_target": "false",
        "name": "ARR",
        "number_of_missing_values": "0"
      },
      {
        "data_type": "numeric",
        "index": "31",
        "is_ignore": "false",
        "is_row_identifier": "false",
        "is_target": "false",
        "name": "SM12_EA.dm.",
        "number_of_missing_values": "0"
      },
      {
        "data_type": "numeric",
        "index": "32",
        "is_ignore": "false",
        "is_row_identifier": "false",
        "is_target": "false",
        "name": "SpMax4_Bh.v.",
        "number_of_missing_values": "0"
      },
      {
        "data_type": "numeric",
        "index": "33",
        "is_ignore": "false",
        "is_row_identifier": "false",
        "is_target": "false",
        "name": "Eig01_EA.dm.",
        "number_of_missing_values": "0"
      },
      {
        "data_type": "numeric",
        "index": "34",
        "is_ignore": "false",
        "is_row_identifier": "false",
        "is_target": "false",
        "name": "SpMax_EA.dm.",
        "number_of_missing_values": "0"
      },
      {
        "data_type": "numeric",
        "index": "35",
        "is_ignore": "false",
        "is_row_identifier": "false",
        "is_target": "false",
        "name": "SssCH2",
        "number_of_missing_values": "0"
      },
      {
        "data_type": "numeric",
        "index": "36",
        "is_ignore": "false",
        "is_row_identifier": "false",
        "is_target": "false",
        "name": "SpMin1_Bh.e.",
        "number_of_missing_values": "0"
      },
      {
        "data_type": "numeric",
        "index": "37",
        "is_ignore": "false",
        "is_row_identifier": "false",
        "is_target": "false",
        "name": "SM14_EA.dm.",
        "number_of_missing_values": "0"
      },
      {
        "data_type": "numeric",
        "index": "38",
        "is_ignore": "false",
        "is_row_identifier": "false",
        "is_target": "false",
        "name": "CATS2D_08_AL",
        "number_of_missing_values": "0"
      },
      {
        "data_type": "numeric",
        "index": "39",
        "is_ignore": "false",
        "is_row_identifier": "false",
        "is_target": "false",
        "name": "ATS8e",
        "number_of_missing_values": "0"
      },
      {
        "data_type": "numeric",
        "index": "40",
        "is_ignore": "false",
        "is_row_identifier": "false",
        "is_target": "false",
        "name": "SsssCH",
        "number_of_missing_values": "0"
      },
      {
        "data_type": "numeric",
        "index": "41",
        "is_ignore": "false",
        "is_row_identifier": "false",
        "is_target": "false",
        "name": "SpMax4_Bh.p.",
        "number_of_missing_values": "0"
      },
      {
        "data_type": "numeric",
        "index": "42",
        "is_ignore": "false",
        "is_row_identifier": "false",
        "is_target": "false",
        "name": "SpDiam_AEA.ri.",
        "number_of_missing_values": "0"
      },
      {
        "data_type": "numeric",
        "index": "43",
        "is_ignore": "false",
        "is_row_identifier": "false",
        "is_target": "false",
        "name": "ATS8i",
        "number_of_missing_values": "0"
      },
      {
        "data_type": "numeric",
        "index": "44",
        "is_ignore": "false",
        "is_row_identifier": "false",
        "is_target": "false",
        "name": "SpMin6_Bh.s.",
        "number_of_missing_values": "0"
      },
      {
        "data_type": "numeric",
        "index": "45",
        "is_ignore": "false",
        "is_row_identifier": "false",
        "is_target": "false",
        "name": "SAdon",
        "number_of_missing_values": "0"
      },
      {
        "data_type": "numeric",
        "index": "46",
        "is_ignore": "false",
        "is_row_identifier": "false",
        "is_target": "false",
        "name": "SpMAD_EA.bo.",
        "number_of_missing_values": "0"
      },
      {
        "data_type": "numeric",
        "index": "47",
        "is_ignore": "false",
        "is_row_identifier": "false",
        "is_target": "false",
        "name": "nCs",
        "number_of_missing_values": "0"
      },
      {
        "data_type": "numeric",
        "index": "48",
        "is_ignore": "false",
        "is_row_identifier": "false",
        "is_target": "false",
        "name": "MATS4s",
        "number_of_missing_values": "0"
      },
      {
        "data_type": "numeric",
        "index": "49",
        "is_ignore": "false",
        "is_row_identifier": "false",
        "is_target": "false",
        "name": "nRNR2",
        "number_of_missing_values": "0"
      },
      {
        "data_type": "numeric",
        "index": "50",
        "is_ignore": "false",
        "is_row_identifier": "false",
        "is_target": "false",
        "name": "GATS4s",
        "number_of_missing_values": "0"
      },
      {
        "data_type": "numeric",
        "index": "51",
        "is_ignore": "false",
        "is_row_identifier": "false",
        "is_target": "false",
        "name": "SpMax4_Bh.e.",
        "number_of_missing_values": "0"
      },
      {
        "data_type": "numeric",
        "index": "52",
        "is_ignore": "false",
        "is_row_identifier": "false",
        "is_target": "false",
        "name": "N.068",
        "number_of_missing_values": "0"
      },
      {
        "data_type": "numeric",
        "index": "53",
        "is_ignore": "false",
        "is_row_identifier": "false",
        "is_target": "false",
        "name": "Eig04_EA.dm.",
        "number_of_missing_values": "0"
      },
      {
        "data_type": "numeric",
        "index": "54",
        "is_ignore": "false",
        "is_row_identifier": "false",
        "is_target": "false",
        "name": "SpMin6_Bh.e.",
        "number_of_missing_values": "0"
      },
      {
        "data_type": "numeric",
        "index": "55",
        "is_ignore": "false",
        "is_row_identifier": "false",
        "is_target": "false",
        "name": "GATS4e",
        "number_of_missing_values": "0"
      },
      {
        "data_type": "numeric",
        "index": "56",
        "is_ignore": "false",
        "is_row_identifier": "false",
        "is_target": "false",
        "name": "Eig01_EA.ed.",
        "number_of_missing_values": "0"
      },
      {
        "data_type": "numeric",
        "index": "57",
        "is_ignore": "false",
        "is_row_identifier": "false",
        "is_target": "false",
        "name": "SM10_AEA.dm.",
        "number_of_missing_values": "0"
      },
      {
        "data_type": "numeric",
        "index": "58",
        "is_ignore": "false",
        "is_row_identifier": "false",
        "is_target": "false",
        "name": "SpMax_EA.ed.",
        "number_of_missing_values": "0"
      },
      {
        "data_type": "numeric",
        "index": "59",
        "is_ignore": "false",
        "is_row_identifier": "false",
        "is_target": "false",
        "name": "ATSC8m",
        "number_of_missing_values": "0"
      },
      {
        "data_type": "numeric",
        "index": "60",
        "is_ignore": "false",
        "is_row_identifier": "false",
        "is_target": "false",
        "name": "CATS2D_07_AA",
        "number_of_missing_values": "0"
      },
      {
        "data_type": "numeric",
        "index": "61",
        "is_ignore": "false",
        "is_row_identifier": "false",
        "is_target": "false",
        "name": "SpMin6_Bh.i.",
        "number_of_missing_values": "0"
      },
      {
        "data_type": "numeric",
        "index": "62",
        "is_ignore": "false",
        "is_row_identifier": "false",
        "is_target": "false",
        "name": "Eig05_EA.dm.",
        "number_of_missing_values": "0"
      },
      {
        "data_type": "numeric",
        "index": "63",
        "is_ignore": "false",
        "is_row_identifier": "false",
        "is_target": "false",
        "name": "SpDiam_EA.bo.",
        "number_of_missing_values": "0"
      },
      {
        "data_type": "numeric",
        "index": "64",
        "is_ignore": "false",
        "is_row_identifier": "false",
        "is_target": "false",
        "name": "Eig01_EA",
        "number_of_missing_values": "0"
      },
      {
        "data_type": "numeric",
        "index": "65",
        "is_ignore": "false",
        "is_row_identifier": "false",
        "is_target": "false",
        "name": "SM09_AEA.bo.",
        "number_of_missing_values": "0"
      },
      {
        "data_type": "numeric",
        "index": "66",
        "is_ignore": "false",
        "is_row_identifier": "false",
        "is_target": "false",
        "name": "SpDiam_EA",
        "number_of_missing_values": "0"
      },
      {
        "data_type": "numeric",
        "index": "67",
        "is_ignore": "false",
        "is_row_identifier": "false",
        "is_target": "false",
        "name": "SpMax_EA",
        "number_of_missing_values": "0"
      },
      {
        "data_type": "numeric",
        "index": "68",
        "is_ignore": "false",
        "is_row_identifier": "false",
        "is_target": "false",
        "name": "SM02_EA.dm.",
        "number_of_missing_values": "0"
      },
      {
        "data_type": "numeric",
        "index": "69",
        "is_ignore": "false",
        "is_row_identifier": "false",
        "is_target": "false",
        "name": "SpMin5_Bh.i.",
        "number_of_missing_values": "0"
      },
      {
        "data_type": "numeric",
        "index": "70",
        "is_ignore": "false",
        "is_row_identifier": "false",
        "is_target": "true",
        "name": "pXC50",
        "number_of_missing_values": "0"
      }
    ]
  }
}