"molecule_id","FCFP4_1024b152","FCFP4_1024b281","FCFP4_1024b760","FCFP4_1024b904","FCFP4_1024b116","FCFP4_1024b15","FCFP4_1024b1","FCFP4_1024b10","FCFP4_1024b100","FCFP4_1024b1000","FCFP4_1024b1001","FCFP4_1024b1002","FCFP4_1024b1003","FCFP4_1024b1004","FCFP4_1024b1005","FCFP4_1024b1006","FCFP4_1024b1007","FCFP4_1024b1008","FCFP4_1024b1009","FCFP4_1024b101","FCFP4_1024b1010","FCFP4_1024b1011","FCFP4_1024b1012","FCFP4_1024b1013","FCFP4_1024b1014","FCFP4_1024b1015","FCFP4_1024b1016","FCFP4_1024b1017","FCFP4_1024b1018","FCFP4_1024b1019","FCFP4_1024b102","FCFP4_1024b1020","FCFP4_1024b1021","FCFP4_1024b1022","FCFP4_1024b1023","FCFP4_1024b1024","FCFP4_1024b103","FCFP4_1024b104","FCFP4_1024b105","FCFP4_1024b106","FCFP4_1024b107","FCFP4_1024b108","FCFP4_1024b109","FCFP4_1024b11","FCFP4_1024b110","FCFP4_1024b111","FCFP4_1024b112","FCFP4_1024b113","FCFP4_1024b114","FCFP4_1024b115","FCFP4_1024b117","FCFP4_1024b118","FCFP4_1024b119","FCFP4_1024b12","FCFP4_1024b120","FCFP4_1024b121","FCFP4_1024b122","FCFP4_1024b123","FCFP4_1024b124","FCFP4_1024b125","FCFP4_1024b126","FCFP4_1024b127","FCFP4_1024b128","FCFP4_1024b129","FCFP4_1024b13","FCFP4_1024b130","FCFP4_1024b131","FCFP4_1024b132","FCFP4_1024b133","FCFP4_1024b134","FCFP4_1024b135","FCFP4_1024b136","FCFP4_1024b137","FCFP4_1024b138","FCFP4_1024b139","FCFP4_1024b14","FCFP4_1024b140","FCFP4_1024b141","FCFP4_1024b142","FCFP4_1024b143","FCFP4_1024b144","FCFP4_1024b145","FCFP4_1024b146","FCFP4_1024b147","FCFP4_1024b148","FCFP4_1024b149","FCFP4_1024b150","FCFP4_1024b151","FCFP4_1024b153","FCFP4_1024b154","FCFP4_1024b155","FCFP4_1024b156","FCFP4_1024b157","FCFP4_1024b158","FCFP4_1024b159","FCFP4_1024b16","FCFP4_1024b160","FCFP4_1024b161","FCFP4_1024b162","FCFP4_1024b163","FCFP4_1024b164","FCFP4_1024b165","FCFP4_1024b166","FCFP4_1024b167","FCFP4_1024b168","FCFP4_1024b169","FCFP4_1024b17","FCFP4_1024b170","FCFP4_1024b171","FCFP4_1024b172","FCFP4_1024b173","FCFP4_1024b174","FCFP4_1024b175","FCFP4_1024b176","FCFP4_1024b177","FCFP4_1024b178","FCFP4_1024b179","FCFP4_1024b18","FCFP4_1024b180","FCFP4_1024b181","FCFP4_1024b182","FCFP4_1024b183","FCFP4_1024b184","FCFP4_1024b185","FCFP4_1024b186","FCFP4_1024b187","FCFP4_1024b188","FCFP4_1024b189","FCFP4_1024b19","FCFP4_1024b190","FCFP4_1024b191","FCFP4_1024b192","FCFP4_1024b193","FCFP4_1024b194","FCFP4_1024b195","FCFP4_1024b196","FCFP4_1024b197","FCFP4_1024b198","FCFP4_1024b199","FCFP4_1024b2","FCFP4_1024b20","FCFP4_1024b200","FCFP4_1024b201","FCFP4_1024b202","FCFP4_1024b203","FCFP4_1024b204","FCFP4_1024b205","FCFP4_1024b206","FCFP4_1024b207","FCFP4_1024b208","FCFP4_1024b209","FCFP4_1024b21","FCFP4_1024b210","FCFP4_1024b211","FCFP4_1024b212","FCFP4_1024b213","FCFP4_1024b214","FCFP4_1024b215","FCFP4_1024b216","FCFP4_1024b217","FCFP4_1024b218","FCFP4_1024b219","FCFP4_1024b22","FCFP4_1024b220","FCFP4_1024b221","FCFP4_1024b222","FCFP4_1024b223","FCFP4_1024b224","FCFP4_1024b225","FCFP4_1024b226","FCFP4_1024b227","FCFP4_1024b228","FCFP4_1024b229","FCFP4_1024b23","FCFP4_1024b230","FCFP4_1024b231","FCFP4_1024b232","FCFP4_1024b233","FCFP4_1024b234","FCFP4_1024b235","FCFP4_1024b236","FCFP4_1024b237","FCFP4_1024b238","FCFP4_1024b239","FCFP4_1024b24","FCFP4_1024b240","FCFP4_1024b241","FCFP4_1024b242","FCFP4_1024b243","FCFP4_1024b244","FCFP4_1024b245","FCFP4_1024b246","FCFP4_1024b247","FCFP4_1024b248","FCFP4_1024b249","FCFP4_1024b25","FCFP4_1024b250","FCFP4_1024b251","FCFP4_1024b252","FCFP4_1024b253","FCFP4_1024b254","FCFP4_1024b255","FCFP4_1024b256","FCFP4_1024b257","FCFP4_1024b258","FCFP4_1024b259","FCFP4_1024b26","FCFP4_1024b260","FCFP4_1024b261","FCFP4_1024b262","FCFP4_1024b263","FCFP4_1024b264","FCFP4_1024b265","FCFP4_1024b266","FCFP4_1024b267","FCFP4_1024b268","FCFP4_1024b269","FCFP4_1024b27","FCFP4_1024b270","FCFP4_1024b271","FCFP4_1024b272","FCFP4_1024b273","FCFP4_1024b274","FCFP4_1024b275","FCFP4_1024b276","FCFP4_1024b277","FCFP4_1024b278","FCFP4_1024b279","FCFP4_1024b28","FCFP4_1024b280","FCFP4_1024b282","FCFP4_1024b283","FCFP4_1024b284","FCFP4_1024b285","FCFP4_1024b286","FCFP4_1024b287","FCFP4_1024b288","FCFP4_1024b289","FCFP4_1024b29","FCFP4_1024b290","FCFP4_1024b291","FCFP4_1024b292","FCFP4_1024b293","FCFP4_1024b294","FCFP4_1024b295","FCFP4_1024b296","FCFP4_1024b297","FCFP4_1024b298","FCFP4_1024b299","FCFP4_1024b3","FCFP4_1024b30","FCFP4_1024b300","FCFP4_1024b301","FCFP4_1024b302","FCFP4_1024b303","FCFP4_1024b304","pXC50"
{7 1,41 1,107 1,108 1,118 1,140 1,150 1,186 1,196 1,221 1,232 1,248 1,253 1,257 6.237}
{0 CHEMBL2058074,1 1,2 1,3 1,4 1,7 1,41 1,63 1,92 1,107 1,108 1,118 1,140 1,220 1,232 1,248 1,253 1,257 5.18}
{0 CHEMBL2058075,1 1,2 1,3 1,4 1,7 1,41 1,107 1,108 1,109 1,111 1,118 1,140 1,196 1,232 1,248 1,253 1,257 5.119}
{0 CHEMBL2058076,1 1,2 1,3 1,4 1,7 1,41 1,107 1,108 1,118 1,140 1,196 1,232 1,248 1,253 1,257 6.481}
{0 CHEMBL2058077,1 1,2 1,3 1,4 1,7 1,41 1,107 1,108 1,118 1,140 1,196 1,232 1,248 1,253 1,257 6}
{0 CHEMBL2058078,1 1,2 1,3 1,4 1,7 1,41 1,107 1,108 1,118 1,140 1,196 1,232 1,248 1,253 1,257 6.268}
{0 CHEMBL2058079,1 1,2 1,3 1,4 1,7 1,41 1,107 1,108 1,118 1,140 1,196 1,232 1,248 1,253 1,257 6}
{0 CHEMBL2058080,1 1,2 1,3 1,4 1,7 1,21 1,41 1,107 1,108 1,118 1,140 1,196 1,232 1,248 1,252 1,253 1,257 6}
{0 CHEMBL2058081,1 1,2 1,3 1,4 1,7 1,41 1,42 1,82 1,107 1,108 1,118 1,140 1,196 1,232 1,248 1,253 1,257 6}
{0 CHEMBL2058082,1 1,2 1,3 1,4 1,7 1,41 1,107 1,108 1,118 1,140 1,192 1,196 1,232 1,248 1,253 1,257 6}
{0 CHEMBL2058083,1 1,2 1,3 1,4 1,7 1,41 1,66 1,107 1,108 1,118 1,140 1,196 1,232 1,248 1,253 1,257 6}
{0 CHEMBL2058084,1 1,2 1,3 1,4 1,7 1,41 1,107 1,108 1,118 1,140 1,196 1,232 1,248 1,253 1,257 6}
{0 CHEMBL2058085,1 1,2 1,3 1,4 1,7 1,41 1,75 1,107 1,108 1,118 1,140 1,196 1,232 1,248 1,253 1,257 6}
{0 CHEMBL2058086,1 1,2 1,3 1,4 1,7 1,41 1,63 1,107 1,108 1,118 1,140 1,196 1,220 1,232 1,248 1,253 1,257 6}
{0 CHEMBL2058087,1 1,2 1,3 1,4 1,7 1,41 1,107 1,108 1,118 1,140 1,196 1,232 1,248 1,253 1,257 6}
{0 CHEMBL2058088,1 1,2 1,3 1,4 1,7 1,8 1,41 1,73 1,107 1,108 1,118 1,140 1,193 1,196 1,232 1,248 1,253 1,257 6}
{0 CHEMBL2058089,1 1,2 1,3 1,4 1,7 1,41 1,107 1,108 1,118 1,125 1,140 1,145 1,158 1,180 1,196 1,232 1,248 1,253 1,257 6}
{0 CHEMBL2058090,1 1,2 1,3 1,4 1,7 1,41 1,55 1,107 1,108 1,118 1,140 1,150 1,196 1,232 1,248 1,253 1,257 6}
{0 CHEMBL2058091,1 1,2 1,3 1,4 1,7 1,41 1,107 1,108 1,118 1,140 1,150 1,186 1,196 1,232 1,248 1,253 1,257 6.398}
{0 CHEMBL2058092,1 1,2 1,3 1,4 1,7 1,41 1,107 1,108 1,118 1,140 1,150 1,186 1,196 1,232 1,248 1,253 1,257 6.638}
{0 CHEMBL2058093,1 1,2 1,3 1,4 1,7 1,41 1,107 1,108 1,118 1,140 1,196 1,232 1,248 1,253 1,257 6}
{0 CHEMBL2058339,1 1,2 1,3 1,4 1,7 1,41 1,73 1,107 1,108 1,118 1,140 1,196 1,232 1,248 1,253 1,257 6.398}
{0 CHEMBL2058340,7 1,31 1,41 1,107 1,108 1,118 1,140 1,150 1,186 1,196 1,232 1,248 1,253 1,257 6}
{0 CHEMBL2058341,7 1,30 1,41 1,107 1,108 1,118 1,140 1,166 1,196 1,232 1,248 1,253 1,257 6}
{0 CHEMBL2058342,7 1,30 1,41 1,107 1,108 1,118 1,140 1,196 1,232 1,248 1,253 1,257 6}
{0 CHEMBL2058343,5 1,6 1,7 1,41 1,107 1,108 1,111 1,118 1,140 1,150 1,186 1,196 1,232 1,248 1,253 1,257 6.721}
{0 CHEMBL2058344,5 1,6 1,7 1,41 1,107 1,108 1,111 1,118 1,140 1,196 1,232 1,248 1,253 1,257 6.167}
{0 CHEMBL2058345,5 1,6 1,7 1,41 1,107 1,108 1,111 1,118 1,140 1,150 1,186 1,196 1,232 1,248 1,253 1,257 6.046}
{0 CHEMBL2058346,5 1,6 1,7 1,41 1,107 1,108 1,111 1,118 1,140 1,150 1,196 1,232 1,248 1,253 1,257 6.222}
{0 CHEMBL2058347,7 1,39 1,41 1,107 1,108 1,118 1,140 1,150 1,186 1,196 1,232 1,248 1,253 1,257 5.777}
{0 CHEMBL2058348,5 1,6 1,7 1,41 1,107 1,108 1,111 1,118 1,140 1,161 1,196 1,232 1,248 1,253 1,257 6}
{0 CHEMBL2058349,5 1,6 1,7 1,41 1,107 1,108 1,111 1,118 1,140 1,150 1,196 1,232 1,248 1,253 1,257 6.585}
{0 CHEMBL2058350,5 1,6 1,7 1,13 1,32 1,41 1,107 1,108 1,111 1,118 1,126 1,140 1,150 1,182 1,196 1,232 1,248 1,253 1,257 6}
{0 CHEMBL2058351,5 1,6 1,7 1,41 1,107 1,108 1,111 1,118 1,140 1,196 1,232 1,248 1,253 1,257 6}
{0 CHEMBL2058352,5 1,6 1,7 1,41 1,63 1,107 1,108 1,111 1,118 1,140 1,196 1,220 1,232 1,248 1,253 1,257 6}
{0 CHEMBL2058353,5 1,6 1,7 1,41 1,107 1,108 1,111 1,118 1,140 1,196 1,232 1,248 1,253 1,257 6}
{0 CHEMBL2058354,5 1,6 1,7 1,41 1,107 1,108 1,111 1,118 1,140 1,196 1,232 1,248 1,253 1,257 6}
{0 CHEMBL2058355,5 1,6 1,7 1,17 1,41 1,75 1,107 1,108 1,111 1,118 1,140 1,196 1,232 1,248 1,253 1,257 6}
{0 CHEMBL2058356,5 1,6 1,7 1,17 1,41 1,75 1,107 1,108 1,111 1,118 1,140 1,196 1,232 1,248 1,253 1,257 6}
{0 CHEMBL2058357,5 1,6 1,7 1,17 1,41 1,75 1,107 1,108 1,111 1,118 1,140 1,196 1,232 1,248 1,253 1,257 6}
{0 CHEMBL2058358,5 1,6 1,7 1,41 1,54 1,107 1,108 1,111 1,118 1,140 1,196 1,232 1,248 1,253 1,257 6.444}
{0 CHEMBL2058359,5 1,6 1,7 1,41 1,107 1,108 1,111 1,118 1,140 1,196 1,220 1,232 1,248 1,253 1,257 7}
