{
  "data_set_description": {
    "citation": "https://archive.ics.uci.edu/ml/citation_policy.html",
    "collection_date": "1994-09-12",
    "creator": [
      "Ron Cole",
      "Mark Fanty"
    ],
    "default_target_attribute": "class",
    "description": "**Author**: Ron Cole and Mark Fanty (cole@cse.ogi.edu, fanty@cse.ogi.edu)  \n**Donor**: Tom Dietterich (tgd@cs.orst.edu)  \n**Source**: [UCI](https://archive.ics.uci.edu/ml/datasets/ISOLET)   \n**Please cite**: UCI  \n\n### Description\n\nISOLET (Isolated Letter Speech Recognition) dataset was generated as follows: 150 subjects spoke the name of each letter of the alphabet twice. Hence, there are 52 training examples from each speaker. The speakers are grouped into sets of 30 speakers each, 4 groups can serve as training set, the last group as the test set. A total of 3 examples are missing, the authors dropped them due to difficulties in recording. \n\nThis is a good domain for a noisy, perceptual task. It is also a very good domain for testing the scaling abilities of algorithms. For example, C4.5 on this domain is slower than backpropagation!\n\n### Source\n\n* Creators: \nRon Cole and Mark Fanty \nDepartment of Computer Science and Engineering, \nOregon Graduate Institute, Beaverton, OR 97006. \ncole '@' cse.ogi.edu, fanty '@' cse.ogi.edu \n\n* Donor: \nTom Dietterich \nDepartment of Computer Science \nOregon State University, Corvallis, OR 97331 \ntgd '@' cs.orst.edu\n\n### Attributes Information\n  \nAll attributes are continuous, real-valued attributes scaled into the range -1.0 to 1.0. The features are described in the paper by Cole and Fanty cited below. \nThe features include spectral coefficients; contour features, sonorant features, pre-sonorant features, and post-sonorant features. The exact order of appearance of the features is not known.\n\n### Relevant papers\n\nFanty, M., Cole, R. (1991).  Spoken letter recognition.  \nIn Lippman, R. P., Moody, J., and Touretzky, D. S. (Eds). Advances in Neural Information Processing Systems 3.  San Mateo, CA: Morgan Kaufmann.\n\nDietterich, T. G., Bakiri, G. (1991)  Error-correcting output codes: A general method for improving multiclass inductive learning programs.  \nProceedings of the Ninth National Conference on Artificial Intelligence (AAAI-91), Anaheim, CA: AAAI Press.\n\nDietterich, T. G., Bakiri, G. (1994) Solving Multiclass Learning Problems via Error-Correcting Output Codes.",
    "description_version": "1",
    "file_id": "52405",
    "format": "ARFF",
    "id": "300",
    "language": "English",
    "licence": "Public",
    "md5_checksum": "7c00e71486690813d4a60181bcbca7f6",
    "minio_url": "https://data.openml.org/datasets/0000/0300/dataset_300.pq",
    "name": "isolet",
    "original_data_url": "https://archive.ics.uci.edu/ml/datasets/isolet",
    "paper_url": "https://www.researchgate.net/profile/Ronald-Cole/publication/221618262_Spoken_Letter_Recognition/links/569ec0a908ae21a56424eddb/Spoken-Letter-Recognition.pdf",
    "parquet_url": "https://data.openml.org/datasets/0000/0300/dataset_300.pq",
    "processing_date": "2020-11-20 19:26:11",
    "status": "active",
    "tag": [
      "Artificial Intelligence",
      "Data Science",
      "Machine Learning",
      "OpenML-CC18",
      "OpenML100",
      "study_1",
      "study_123",
      "study_14",
      "study_34",
      "study_41",
      "study_99"
    ],
    "upload_date": "2014-08-20T20:59:05",
    "url": "https://api.openml.org/data/v1/download/52405/isolet.arff",
    "version": "1",
    "visibility": "public"
  }
}