{
  "data_features": {
    "feature": [
      {
        "data_type": "nominal",
        "index": "0",
        "is_ignore": "false",
        "is_row_identifier": "true",
        "is_target": "false",
        "name": "molecule_id",
        "nominal_value": [
          "CHEMBL1290648",
          "CHEMBL1765476",
          "CHEMBL1765479",
          "CHEMBL2147156",
          "CHEMBL2206660",
          "CHEMBL258728",
          "CHEMBL445773",
          "CHEMBL447360",
          "CHEMBL460741",
          "CHEMBL460901",
          "CHEMBL504858",
          "CHEMBL53463",
          "CHEMBL574297",
          "CHEMBL582887",
          "CHEMBL595547"
        ],
        "number_of_missing_values": "0"
      },
      {
        "data_type": "numeric",
        "index": "1",
        "is_ignore": "false",
        "is_row_identifier": "false",
        "is_target": "false",
        "name": "AMW",
        "number_of_missing_values": "0"
      },
      {
        "data_type": "numeric",
        "index": "2",
        "is_ignore": "false",
        "is_row_identifier": "false",
        "is_target": "false",
        "name": "C.",
        "number_of_missing_values": "0"
      },
      {
        "data_type": "numeric",
        "index": "3",
        "is_ignore": "false",
        "is_row_identifier": "false",
        "is_target": "true",
        "name": "pXC50",
        "number_of_missing_values": "0"
      }
    ]
  }
}