{
  "data_set_description": {
    "collection_date": "November 2013",
    "creator": "Dr Jeremy Besnard, Dr Ivan Olier, Dr Noureddin Sadawi, Dr Larisa Soldatova, Dr Crina Grosan, Prof Ross King, Dr Richard Bickerton, Prof Andrew Hopkins and Dr Willem van Hoorn",
    "default_target_attribute": "pXC50",
    "description": "This dataset contains QSAR data (from ChEMBL version 17) showing activity values (unit is pseudo-pCI50) of several compounds on drug target ChEMBL_ID: CHEMBL5460 (TID: 100986), and it has 84 rows and 1331 features (not including molecule IDs and class feature: molecule_id and pXC50). The features represent Molecular Descriptors which were generated from SMILES strings. Missing value imputation was applied to this dataset (By choosing the Median).",
    "description_version": "1",
    "file_id": "3407514",
    "format": "ARFF",
    "id": "29978",
    "licence": "Public",
    "md5_checksum": "4654b4533d7b95090edd24d539f4a038",
    "minio_url": "https://data.openml.org/datasets/0002/29978/dataset_29978.pq",
    "name": "QSAR-DATASET-FOR-DRUG-TARGET-CHEMBL5460",
    "original_data_url": "https://www.ebi.ac.uk/chembl/target/inspect/CHEMBL5460",
    "parquet_url": "https://data.openml.org/datasets/0002/29978/dataset_29978.pq",
    "processing_date": "2018-10-04 01:53:00",
    "row_id_attribute": "molecule_id",
    "status": "deactivated",
    "tag": [
      "MetaQSAR",
      "study_13"
    ],
    "upload_date": "2016-07-15T03:51:15",
    "url": "https://api.openml.org/data/v1/download/3407514/QSAR-DATASET-FOR-DRUG-TARGET-CHEMBL5460.arff",
    "version": "8",
    "visibility": "public"
  }
}