{
  "data_set_description": {
    "collection_date": "November 2013",
    "creator": "Dr Jeremy Besnard, Dr Ivan Olier, Dr Noureddin Sadawi, Dr Larisa Soldatova, Dr Crina Grosan, Prof Ross King, Dr Richard Bickerton, Prof Andrew Hopkins and Dr Willem van Hoorn",
    "default_target_attribute": "pXC50",
    "description": "This dataset contains QSAR data (from ChEMBL version 17) showing activity values (unit is pseudo-pCI50) of several compounds on drug target ChEMBL_ID: CHEMBL3198 (TID: 10666), and it has 229 rows and 1258 features (not including molecule IDs and class feature: molecule_id and pXC50). The features represent Molecular Descriptors which were generated from SMILES strings. Missing value imputation was applied to this dataset (By choosing the Median).",
    "description_version": "1",
    "file_id": "3402870",
    "format": "ARFF",
    "id": "29818",
    "licence": "Public",
    "md5_checksum": "ac984fc65c651c5b4edeb44d79685fb9",
    "minio_url": "https://data.openml.org/datasets/0002/29818/dataset_29818.pq",
    "name": "QSAR-DATASET-FOR-DRUG-TARGET-CHEMBL3198",
    "original_data_url": "https://www.ebi.ac.uk/chembl/target/inspect/CHEMBL3198",
    "parquet_url": "https://data.openml.org/datasets/0002/29818/dataset_29818.pq",
    "processing_date": "2018-10-04 01:39:43",
    "row_id_attribute": "molecule_id",
    "status": "deactivated",
    "tag": [
      "MetaQSAR",
      "study_13"
    ],
    "upload_date": "2016-07-15T03:27:09",
    "url": "https://api.openml.org/data/v1/download/3402870/QSAR-DATASET-FOR-DRUG-TARGET-CHEMBL3198.arff",
    "version": "10",
    "visibility": "public"
  }
}