{
  "data_set_description": {
    "collection_date": "November 2013",
    "creator": "Dr Jeremy Besnard, Dr Ivan Olier, Dr Noureddin Sadawi, Dr Larisa Soldatova, Dr Crina Grosan, Prof Ross King, Dr Richard Bickerton, Prof Andrew Hopkins and Dr Willem van Hoorn",
    "default_target_attribute": "pXC50",
    "description": "This dataset contains QSAR data (from ChEMBL version 17) showing activity values (unit is pseudo-pCI50) of several compounds on drug target ChEMBL_ID: CHEMBL4655 (TID: 10626), and it has 24 rows and 1138 features (not including molecule IDs and class feature: molecule_id and pXC50). The features represent Molecular Descriptors which were generated from SMILES strings. Missing value imputation was applied to this dataset (By choosing the Median).",
    "description_version": "1",
    "file_id": "3401912",
    "format": "ARFF",
    "id": "29778",
    "licence": "Public",
    "md5_checksum": "ec8c51d496b80a7c60a8c10e6610318a",
    "minio_url": "https://data.openml.org/datasets/0002/29778/dataset_29778.pq",
    "name": "QSAR-DATASET-FOR-DRUG-TARGET-CHEMBL4655",
    "original_data_url": "https://www.ebi.ac.uk/chembl/target/inspect/CHEMBL4655",
    "parquet_url": "https://data.openml.org/datasets/0002/29778/dataset_29778.pq",
    "processing_date": "2018-10-04 01:40:06",
    "row_id_attribute": "molecule_id",
    "status": "deactivated",
    "tag": [
      "MetaQSAR",
      "study_13"
    ],
    "upload_date": "2016-07-15T03:21:18",
    "url": "https://api.openml.org/data/v1/download/3401912/QSAR-DATASET-FOR-DRUG-TARGET-CHEMBL4655.arff",
    "version": "8",
    "visibility": "public"
  }
}