{
  "data_set_description": {
    "collection_date": "November 2013",
    "creator": "Dr Jeremy Besnard, Dr Ivan Olier, Dr Noureddin Sadawi, Dr Larisa Soldatova, Dr Crina Grosan, Prof Ross King, Dr Richard Bickerton, Prof Andrew Hopkins and Dr Willem van Hoorn",
    "default_target_attribute": "pXC50",
    "description": "This dataset contains QSAR data (from ChEMBL version 17) showing activity values (unit is pseudo-pCI50) of several compounds on drug target ChEMBL_ID: CHEMBL2156 (TID: 10707), and it has 10 rows and 1081 features (not including molecule IDs and class feature: molecule_id and pXC50). The features represent Molecular Descriptors which were generated from SMILES strings. Missing value imputation was applied to this dataset (By choosing the Median).",
    "description_version": "1",
    "file_id": "3401148",
    "format": "ARFF",
    "id": "29762",
    "licence": "Public",
    "md5_checksum": "9af010424b442724a6e54366c1d44863",
    "minio_url": "https://data.openml.org/datasets/0002/29762/dataset_29762.pq",
    "name": "QSAR-DATASET-FOR-DRUG-TARGET-CHEMBL2156",
    "original_data_url": "https://www.ebi.ac.uk/chembl/target/inspect/CHEMBL2156",
    "parquet_url": "https://data.openml.org/datasets/0002/29762/dataset_29762.pq",
    "processing_date": "2018-10-04 01:45:43",
    "row_id_attribute": "molecule_id",
    "status": "deactivated",
    "tag": [
      "MetaQSAR",
      "study_13"
    ],
    "upload_date": "2016-07-15T03:18:24",
    "url": "https://api.openml.org/data/v1/download/3401148/QSAR-DATASET-FOR-DRUG-TARGET-CHEMBL2156.arff",
    "version": "6",
    "visibility": "public"
  }
}