"molecule_id","AMW","C.","H.","Me","Mi","Mp","Mv","MW","N.","nAB","nAT","nB","nBM","nBO","nBR","nBT","nC","nCL","nCsp","nCsp2","nCsp3","nDB","nF","nH","nHet","nHM","nI","nN","nO","nP","nS","nSK","nTB","nX","O.","RBF","RBN","SCBO","Se","Si","Sp","Sv","X.","pXC50"
{1 7.593,2 32.6,3 46.1,4 1.026,5 1.149,6 0.615,7 0.604,8 675.79,9 10.1,10 6,11 89,13 15,14 49,16 90,17 29,20 15,21 14,22 9,24 41,25 19,28 9,29 10,32 48,35 11.2,36 0.111,37 10,38 61,39 91.327,40 102.222,41 54.779,42 53.769,44 7.602}
{0 CHEMBL443088,1 7.193,2 26.3,3 50,4 1.026,5 1.164,6 0.584,7 0.57,8 273.34,9 13.2,11 38,13 4,14 18,16 37,17 10,20 4,21 6,22 4,24 19,25 9,28 5,29 4,32 19,35 10.5,36 0.216,37 8,38 22,39 39.003,40 44.236,41 22.176,42 21.654,44 4.509}
{0 CHEMBL449892,1 7.39,2 32.1,3 47.6,4 1.023,5 1.149,6 0.611,7 0.596,8 620.75,9 9.5,10 6,11 84,13 14,14 44,16 84,17 27,20 14,21 13,22 8,24 40,25 17,28 8,29 9,32 44,35 10.7,36 0.214,37 18,38 55,39 85.898,40 96.514,41 51.318,42 50.033,44 5.076}
{0 CHEMBL450552,1 7.281,2 33.3,3 48.1,4 1.018,5 1.146,6 0.616,7 0.596,8 589.73,9 8.6,10 6,11 81,13 14,14 42,16 81,17 27,20 15,21 12,22 8,24 39,25 15,28 7,29 8,32 42,35 9.9,36 0.235,37 19,38 53,39 82.469,40 92.807,41 49.858,42 48.297,44 6.854}
{0 CHEMBL454279,1 7.461,2 32.7,3 47.1,4 1.024,5 1.147,6 0.613,7 0.599,8 775.92,9 8.7,10 6,11 104,13 17,14 55,16 104,17 34,20 18,21 16,22 11,24 49,25 21,28 9,29 12,32 55,35 11.5,36 0.24,37 25,38 69,39 106.516,40 119.302,41 63.733,42 62.306,44 5.959}
{0 CHEMBL492713,1 7.176,2 27.1,3 50,4 1.025,5 1.162,6 0.587,7 0.572,8 344.43,9 12.5,11 48,13 5,14 23,16 47,17 13,20 5,21 8,22 5,24 24,25 11,28 6,29 5,32 24,35 10.4,36 0.213,37 10,38 28,39 49.2,40 55.774,41 28.159,42 27.444,44 5.18}
{0 CHEMBL492714,1 7.533,2 27.9,3 47.5,4 1.034,5 1.16,6 0.591,7 0.585,8 459.53,9 11.5,11 61,13 7,14 31,16 60,17 17,20 7,21 10,22 7,24 29,25 15,28 7,29 8,32 32,35 13.1,36 0.233,37 14,38 38,39 63.051,40 70.731,41 36.051,42 35.663,44 4.495}
{0 CHEMBL493316,1 7.124,2 32.8,3 49.2,4 1.014,5 1.148,6 0.614,7 0.591,8 434.56,9 9.8,10 6,11 61,13 11,14 31,16 61,17 20,20 11,21 9,22 5,24 30,25 11,28 6,29 5,32 31,35 8.2,36 0.197,37 12,38 39,39 61.851,40 70.019,41 37.443,42 36.024,44 6.125}
{0 CHEMBL506684,1 7.262,2 33,3 48.4,4 1.018,5 1.147,6 0.614,7 0.594,8 660.82,9 8.8,10 6,11 91,13 15,14 47,16 91,17 30,20 16,21 14,22 9,24 44,25 17,28 8,29 9,32 47,35 9.9,36 0.231,37 21,38 59,39 92.665,40 104.345,41 55.841,42 54.087,44 7.602}
{0 CHEMBL522670,1 7.122,2 32.4,3 49.3,4 1.015,5 1.149,6 0.612,7 0.589,8 505.65,9 9.9,10 6,11 71,13 12,14 36,16 71,17 23,20 12,21 11,22 6,24 35,25 13,28 7,29 6,32 36,35 8.5,36 0.197,37 14,38 45,39 72.047,40 81.557,41 43.426,42 41.814,44 7.046}
