{
  "data_set_description": {
    "collection_date": "November 2013",
    "creator": "Dr Jeremy Besnard, Dr Ivan Olier, Dr Noureddin Sadawi, Dr Larisa Soldatova, Dr Crina Grosan, Prof Ross King, Dr Richard Bickerton, Prof Andrew Hopkins and Dr Willem van Hoorn",
    "default_target_attribute": "pXC50",
    "description": "This dataset contains QSAR data (from ChEMBL version 17) showing activity values (unit is pseudo-pCI50) of several compounds on drug target ChEMBL_ID: CHEMBL4117 (TID: 19624), and it has 52 rows and 1172 features (not including molecule IDs and class feature: molecule_id and pXC50). The features represent Molecular Descriptors which were generated from SMILES strings. Missing value imputation was applied to this dataset (By choosing the Median).",
    "description_version": "1",
    "file_id": "3400916",
    "format": "ARFF",
    "id": "29732",
    "licence": "Public",
    "md5_checksum": "281b21d3876ab73454eb6e5001bacaa0",
    "minio_url": "https://data.openml.org/datasets/0002/29732/dataset_29732.pq",
    "name": "QSAR-DATASET-FOR-DRUG-TARGET-CHEMBL4117",
    "original_data_url": "https://www.ebi.ac.uk/chembl/target/inspect/CHEMBL4117",
    "parquet_url": "https://data.openml.org/datasets/0002/29732/dataset_29732.pq",
    "processing_date": "2018-10-04 01:39:37",
    "row_id_attribute": "molecule_id",
    "status": "deactivated",
    "tag": [
      "MetaQSAR",
      "study_13"
    ],
    "upload_date": "2016-07-15T03:14:19",
    "url": "https://api.openml.org/data/v1/download/3400916/QSAR-DATASET-FOR-DRUG-TARGET-CHEMBL4117.arff",
    "version": "8",
    "visibility": "public"
  }
}