{
  "data_qualities": {
    "quality": [
      {
        "name": "AutoCorrelation",
        "value": "-0.013027777777777614"
      },
      {
        "name": "ClassEntropy",
        "value": []
      },
      {
        "name": "Dimensionality",
        "value": "30.83783783783784"
      },
      {
        "name": "EquivalentNumberOfAtts",
        "value": []
      },
      {
        "name": "MajorityClassPercentage",
        "value": []
      },
      {
        "name": "MajorityClassSize",
        "value": []
      },
      {
        "name": "MaxAttributeEntropy",
        "value": []
      },
      {
        "name": "MaxKurtosisOfNumericAtts",
        "value": "37.000000000000306"
      },
      {
        "name": "MaxMeansOfNumericAtts",
        "value": "26054.45945945946"
      },
      {
        "name": "MaxMutualInformation",
        "value": []
      },
      {
        "name": "MaxNominalAttDistinctValues",
        "value": []
      },
      {
        "name": "MaxSkewnessOfNumericAtts",
        "value": "6.08276253029822"
      },
      {
        "name": "MaxStdDevOfNumericAtts",
        "value": "10040.224390461142"
      },
      {
        "name": "MeanAttributeEntropy",
        "value": []
      },
      {
        "name": "MeanKurtosisOfNumericAtts",
        "value": "2.0777404575844507"
      },
      {
        "name": "MeanMeansOfNumericAtts",
        "value": "100.09694087245137"
      },
      {
        "name": "MeanMutualInformation",
        "value": []
      },
      {
        "name": "MeanNoiseToSignalRatio",
        "value": []
      },
      {
        "name": "MeanNominalAttDistinctValues",
        "value": []
      },
      {
        "name": "MeanSkewnessOfNumericAtts",
        "value": "0.32882027055371876"
      },
      {
        "name": "MeanStdDevOfNumericAtts",
        "value": "33.943083943520655"
      },
      {
        "name": "MinAttributeEntropy",
        "value": []
      },
      {
        "name": "MinKurtosisOfNumericAtts",
        "value": "-2.0261833282220807"
      },
      {
        "name": "MinMeansOfNumericAtts",
        "value": "-3.5475675675675675"
      },
      {
        "name": "MinMutualInformation",
        "value": []
      },
      {
        "name": "MinNominalAttDistinctValues",
        "value": []
      },
      {
        "name": "MinSkewnessOfNumericAtts",
        "value": "-6.08276253029822"
      },
      {
        "name": "MinStdDevOfNumericAtts",
        "value": "0.0010959932487023818"
      },
      {
        "name": "MinorityClassPercentage",
        "value": []
      },
      {
        "name": "MinorityClassSize",
        "value": []
      },
      {
        "name": "NumberOfBinaryFeatures",
        "value": "0.0"
      },
      {
        "name": "NumberOfClasses",
        "value": "0.0"
      },
      {
        "name": "NumberOfFeatures",
        "value": "1141.0"
      },
      {
        "name": "NumberOfInstances",
        "value": "37.0"
      },
      {
        "name": "NumberOfInstancesWithMissingValues",
        "value": "0.0"
      },
      {
        "name": "NumberOfMissingValues",
        "value": "0.0"
      },
      {
        "name": "NumberOfNumericFeatures",
        "value": "1140.0"
      },
      {
        "name": "NumberOfSymbolicFeatures",
        "value": "1.0"
      },
      {
        "name": "PercentageOfBinaryFeatures",
        "value": "0.0"
      },
      {
        "name": "PercentageOfInstancesWithMissingValues",
        "value": "0.0"
      },
      {
        "name": "PercentageOfMissingValues",
        "value": "0.0"
      },
      {
        "name": "PercentageOfNumericFeatures",
        "value": "99.91235758106923"
      },
      {
        "name": "PercentageOfSymbolicFeatures",
        "value": "0.0876424189307625"
      },
      {
        "name": "Quartile1AttributeEntropy",
        "value": []
      },
      {
        "name": "Quartile1KurtosisOfNumericAtts",
        "value": "-1.0983683642592617"
      },
      {
        "name": "Quartile1MeansOfNumericAtts",
        "value": "0.8414459459459459"
      },
      {
        "name": "Quartile1MutualInformation",
        "value": []
      },
      {
        "name": "Quartile1SkewnessOfNumericAtts",
        "value": "-0.5208274859118632"
      },
      {
        "name": "Quartile1StdDevOfNumericAtts",
        "value": "0.1206129469507256"
      },
      {
        "name": "Quartile2AttributeEntropy",
        "value": []
      },
      {
        "name": "Quartile2KurtosisOfNumericAtts",
        "value": "-0.44183966432360466"
      },
      {
        "name": "Quartile2MeansOfNumericAtts",
        "value": "3.106027027027027"
      },
      {
        "name": "Quartile2MutualInformation",
        "value": []
      },
      {
        "name": "Quartile2SkewnessOfNumericAtts",
        "value": "-0.039868342836595114"
      },
      {
        "name": "Quartile2StdDevOfNumericAtts",
        "value": "0.2830368026510841"
      },
      {
        "name": "Quartile3AttributeEntropy",
        "value": []
      },
      {
        "name": "Quartile3KurtosisOfNumericAtts",
        "value": "1.6854771568456741"
      },
      {
        "name": "Quartile3MeansOfNumericAtts",
        "value": "8.476391891891891"
      },
      {
        "name": "Quartile3MutualInformation",
        "value": []
      },
      {
        "name": "Quartile3SkewnessOfNumericAtts",
        "value": "0.8189427099253757"
      },
      {
        "name": "Quartile3StdDevOfNumericAtts",
        "value": "1.1335516522833515"
      },
      {
        "name": "StdvNominalAttDistinctValues",
        "value": []
      }
    ]
  }
}