"molecule_id","FCFP4_1024b345","FCFP4_1024b1","FCFP4_1024b10","FCFP4_1024b100","FCFP4_1024b1000","FCFP4_1024b1001","FCFP4_1024b1002","FCFP4_1024b1003","FCFP4_1024b1004","FCFP4_1024b1005","FCFP4_1024b1006","FCFP4_1024b1007","FCFP4_1024b1008","FCFP4_1024b1009","FCFP4_1024b101","FCFP4_1024b1010","FCFP4_1024b1011","FCFP4_1024b1012","FCFP4_1024b1013","FCFP4_1024b1014","FCFP4_1024b1015","FCFP4_1024b1016","FCFP4_1024b1017","FCFP4_1024b1018","FCFP4_1024b1019","FCFP4_1024b102","FCFP4_1024b1020","FCFP4_1024b1021","FCFP4_1024b1022","FCFP4_1024b1023","FCFP4_1024b1024","FCFP4_1024b103","FCFP4_1024b104","FCFP4_1024b105","FCFP4_1024b106","FCFP4_1024b107","FCFP4_1024b108","FCFP4_1024b109","FCFP4_1024b11","FCFP4_1024b110","FCFP4_1024b111","FCFP4_1024b112","FCFP4_1024b113","FCFP4_1024b114","FCFP4_1024b115","FCFP4_1024b116","FCFP4_1024b117","FCFP4_1024b118","FCFP4_1024b119","FCFP4_1024b12","FCFP4_1024b120","pXC50"
{2 1,43 1,44 1,52 5.292}
{0 CHEMBL1790636,2 1,43 1,52 4.469}
{0 CHEMBL1790637,2 1,43 1,44 1,52 4.376}
{0 CHEMBL1790638,2 1,43 1,44 1,52 4.69}
{0 CHEMBL1790639,2 1,43 1,44 1,52 4.538}
{0 CHEMBL1790640,1 1,2 1,27 1,43 1,44 1,52 4.975}
{0 CHEMBL1790641,1 1,2 1,43 1,44 1,52 5.009}
{0 CHEMBL266681,2 1,35 1,44 1,52 6.131}
{0 CHEMBL310151,2 1,43 1,44 1,52 4.83}
{0 CHEMBL310546,2 1,43 1,44 1,52 5.284}
{0 CHEMBL311026,2 1,35 1,43 1,44 1,52 5.387}
{0 CHEMBL407790,2 1,35 1,52 4.842}
{0 CHEMBL411352,2 1,35 1,52 6}
{0 CHEMBL83807,2 1,43 1,44 1,52 5.347}
