{
  "data_features": {
    "feature": [
      {
        "data_type": "nominal",
        "index": "0",
        "is_ignore": "false",
        "is_row_identifier": "true",
        "is_target": "false",
        "name": "molecule_id",
        "nominal_value": [
          "CHEMBL1652555",
          "CHEMBL1916397",
          "CHEMBL217327",
          "CHEMBL2205794",
          "CHEMBL2205795",
          "CHEMBL2205796",
          "CHEMBL2205797",
          "CHEMBL2206348",
          "CHEMBL2206349",
          "CHEMBL2206350",
          "CHEMBL2206351",
          "CHEMBL2206352",
          "CHEMBL2206353",
          "CHEMBL2206354",
          "CHEMBL2206355",
          "CHEMBL2206358",
          "CHEMBL2206362",
          "CHEMBL2206363",
          "CHEMBL2206364",
          "CHEMBL2206682",
          "CHEMBL2206686",
          "CHEMBL2206687",
          "CHEMBL2206697",
          "CHEMBL2206698",
          "CHEMBL263158",
          "CHEMBL264653",
          "CHEMBL269566",
          "CHEMBL385968",
          "CHEMBL405302",
          "CHEMBL405999",
          "CHEMBL412223",
          "CHEMBL412236",
          "CHEMBL437837",
          "CHEMBL438371"
        ],
        "number_of_missing_values": "0"
      },
      {
        "data_type": "numeric",
        "index": "1",
        "is_ignore": "false",
        "is_row_identifier": "false",
        "is_target": "false",
        "name": "nAT",
        "number_of_missing_values": "0"
      },
      {
        "data_type": "numeric",
        "index": "2",
        "is_ignore": "false",
        "is_row_identifier": "false",
        "is_target": "false",
        "name": "nBO",
        "number_of_missing_values": "0"
      },
      {
        "data_type": "numeric",
        "index": "3",
        "is_ignore": "false",
        "is_row_identifier": "false",
        "is_target": "false",
        "name": "nO",
        "number_of_missing_values": "0"
      },
      {
        "data_type": "numeric",
        "index": "4",
        "is_ignore": "false",
        "is_row_identifier": "false",
        "is_target": "false",
        "name": "nSK",
        "number_of_missing_values": "0"
      },
      {
        "data_type": "numeric",
        "index": "5",
        "is_ignore": "false",
        "is_row_identifier": "false",
        "is_target": "false",
        "name": "Se",
        "number_of_missing_values": "0"
      },
      {
        "data_type": "numeric",
        "index": "6",
        "is_ignore": "false",
        "is_row_identifier": "false",
        "is_target": "false",
        "name": "Si",
        "number_of_missing_values": "0"
      },
      {
        "data_type": "numeric",
        "index": "7",
        "is_ignore": "false",
        "is_row_identifier": "false",
        "is_target": "true",
        "name": "pXC50",
        "number_of_missing_values": "0"
      }
    ]
  }
}