"molecule_id","ATSC7p","SpMax7_Bh.m.","X0sol","X2sol","X3sol","X4sol","X5sol","ATSC3s","ATSC7m","SpMax2_Bh.m.","SpMax3_Bh.m.","X0v","X1sol","X5v","ATS2p","ATS4p","ATS5p","ATS6p","ATSC1s","ATSC5p","ATSC6p","ATSC8p","SdO","SpMax4_Bh.m.","ATSC2e","AAC","C.002","CATS2D_01_LL","CATS2D_02_LL","CATS2D_03_LL","CATS2D_04_LL","CATS2D_05_LL","CATS2D_06_AL","CATS2D_07_AL","CATS2D_07_LL","CATS2D_08_LL","GATS1s","H.046","Hy","IC0","JGT","MATS1s","MATS2s","N.","NssCH2","Psi_e_A","Psi_i_A","P_VSA_i_2","P_VSA_LogP_7","SaaCH","SaasC","SAdon","SpMax2_Bh.e.","SpMax2_Bh.i.","SpMax4_Bh.s.","SpMin1_Bh.s.","GATS1e","CATS2D_01_AN","Eig01_AEA.dm.","Eig02_AEA.bo.","nO","O.","P_VSA_e_5","P_VSA_i_1","SpMax_AEA.dm.","TPSA.NO.","TPSA.Tot.","SpMax8_Bh.p.","BIC2","SdsCH","SssO","SM12_EA.ri.","SM13_EA.ri.","SM14_EA.ri.","ATSC8m","AMR","ATS3m","ATSC3p","ATSC4m","ATSC4p","Eta_C","Eta_C_A","H.","IC1","VvdwMG","Vx","X1v","X2v","X3v","X4v","ATS3p","ATS3v","ATS5v","ATS6v","ATS7v","BIC1","CIC1","CIC2","SIC1","P_VSA_MR_3","MATS2v","ATSC1e","ATSC5e","ATSC6s","CATS2D_02_AA","nHet","P_VSA_m_3","P_VSA_p_2","P_VSA_v_2","SAacc","ATS6m","GATS2m","ATSC2s","SpMin2_Bh.s.","ATS6s","GATS7v","ON0V","SpMax4_Bh.p.","SpMax4_Bh.v.","SpMax7_Bh.p.","SsOH","BIC0","SIC0","ATSC3e","CIC3","ATS1v","ATS7m","ATSC3i","ATSC4i","ATSC5i","ATSC6i","ATSC7i","CATS2D_04_AN","CENT","CSI","ECC","Eig03_AEA.dm.","Eig04_AEA.bo.","Eig04_AEA.ri.","Eig04_EA","Eig04_EA.bo.","Eig04_EA.ri.","Eig05_AEA.bo.","Eig05_AEA.dm.","Eig05_AEA.ri.","Eig05_EA","Eig05_EA.bo.","Eig05_EA.ed.","Eig05_EA.ri.","Eig06_AEA.bo.","Eig06_AEA.ed.","Eig06_AEA.ri.","Eig06_EA.bo.","Eig06_EA.ed.","Eig06_EA.ri.","Eig08_AEA.bo.","Eig08_AEA.dm.","Eig08_AEA.ri.","Eig08_EA","Eig08_EA.bo.","Eig08_EA.ri.","Eig09_AEA.bo.","Eig09_AEA.dm.","Eig09_AEA.ed.","Eig09_AEA.ri.","Eig09_EA","Eig09_EA.bo.","Eig09_EA.ed.","Eig09_EA.ri.","Eig10_AEA.ed.","Eig10_AEA.ri.","Eig10_EA","Eig10_EA.ed.","Eig11_AEA.ed.","Eig12_AEA.bo.","Eig12_AEA.dm.","Eig12_AEA.ed.","Eig12_AEA.ri.","Eig12_EA","Eig12_EA.ed.","Eig12_EA.ri.","Eig13_AEA.bo.","Eig13_AEA.dm.","Eig13_EA.bo.","pXC50"
{1 5.545,2 2.778,3 17.034,4 12.282,5 8.297,6 6.02,7 5.251,8 161.974,9 25.745,10 4.416,11 3.817,12 12.859,13 11.175,14 1.809,15 3.474,16 3.516,17 3.466,18 3.359,19 67.341,20 7.43,21 6.945,22 4.476,23 33.531,24 3.578,25 1.108,26 2.088,27 1,32 1,33 2,37 0.937,39 2.203,40 2.088,41 0.657,42 -0.239,43 0.283,44 6.1,45 2,46 8.741,47 3.241,48 74.164,49 70.627,52 134.958,53 3.734,54 3.75,55 6.45,56 1.207,57 1.144,58 2,59 3.858,60 4.303,61 8,62 24.2,63 205.422,64 3.143,65 3.858,66 151.08,67 160.89,68 1.969,69 0.903,70 1.213,71 9.601,72 13.969,73 15.051,74 16.148,75 29.868,76 69.806,77 4.181,78 7.209,79 22.624,80 7.374,81 20.124,82 0.958,83 36.4,84 4.123,85 144.934,86 345.399,87 8.041,88 6.456,89 3.896,90 2.542,91 3.566,92 3.562,93 3.41,94 3.317,95 3.019,96 0.786,97 0.921,98 0.303,99 0.817,100 134.869,101 -0.063,102 0.519,103 1.353,104 187.341,105 3,106 12,107 205.422,108 226.557,109 226.557,110 226.557,111 3.933,112 0.612,113 128.142,114 0.978,115 6.019,116 1.029,117 5.31,118 2.973,119 2.955,120 2.281,121 26.993,122 0.398,123 0.414,124 1.428,125 0.242,126 3.119,127 3.705,128 0.758,129 0.697,130 0.644,131 0.564,132 0.433,133 1,134 552,135 365,136 181,137 3.278,138 3.615,139 3.334,140 2.396,141 2.724,142 2.213,143 3.13,144 2.62,145 2.772,146 1.825,147 2.163,148 5.287,149 1.691,150 2.717,151 4.289,152 2.359,153 1.645,154 3.936,155 1.299,156 1.721,157 1.474,158 1.422,159 0.56,160 0.591,161 0.47,162 1.542,163 1.062,164 3.096,165 1.269,166 0.369,167 0.42,168 0.908,169 0.267,170 2.647,171 0.539,172 -0.495,173 -1.238,174 2.524,175 0.592,176 -0.058,177 2.22,178 0.12,179 -0.733,180 -1.944,181 -0.561,182 0.422,183 -0.563,184 -1,185 5}
{0 CHEMBL1649596,1 3.454,2 2.157,3 13.139,4 9.221,5 5.074,6 3.723,7 2.617,8 122.554,9 11.102,10 3.801,11 3.464,12 9.839,13 8.81,14 0.978,15 3.31,16 3.196,17 3.025,18 2.89,19 42.207,20 4.5,21 3.675,22 3.276,23 32.489,24 3.062,25 0.616,26 1.899,27 1,28 2,29 1,31 1,32 1,33 2,34 1,37 0.838,39 1.424,40 1.899,41 0.579,42 -0.196,43 0.33,44 6.7,45 3,46 8.685,47 3.185,48 51.097,49 105.94,52 92.274,53 3.76,54 3.785,55 6.435,56 1.233,57 1.001,58 1,59 3.758,60 4.091,61 5,62 16.7,63 144.817,64 1.248,65 3.758,66 112.39,67 122.2,68 1.691,69 0.879,70 5.769,72 13.773,73 14.871,74 15.986,75 12.358,76 61.595,77 3.362,78 5.815,79 17.741,80 5.17,81 12.086,82 0.711,83 43.3,84 3.857,85 125.497,86 297.973,87 6.675,88 5.187,89 2.793,90 1.622,91 3.355,92 3.277,93 2.886,94 2.779,95 2.699,96 0.752,97 1.05,98 0.4,99 0.786,100 74.264,101 -0.207,102 0.265,103 0.454,104 71.403,105 1,106 8,107 144.817,108 165.952,109 165.952,110 165.952,111 2.903,112 1.135,113 89.363,114 0.966,115 5.003,116 1.011,117 4.883,118 2.904,119 2.895,120 2.136,121 17.182,122 0.37,123 0.387,124 0.706,125 0.333,126 2.953,127 2.94,128 0.656,129 0.561,130 0.465,131 0.406,132 0.368,134 320,135 292,136 150,137 3.103,138 3.157,139 2.695,140 1.689,141 2.221,142 1.693,143 2.866,144 1.926,145 2.406,146 1.424,147 1.817,148 3.256,149 1.387,150 2.126,151 3.273,152 1.862,153 0.981,154 1.896,155 0.861,156 1,157 0.723,158 0.671,159 -0.341,160 -0.389,161 -0.343,162 0.891,163 0.069,164 2.22,165 0.536,166 -0.515,167 -0.656,168 -1.242,169 -0.526,170 2,172 -1,173 -2.497,174 2,176 -1,177 1.74,179 -1,180 -3,181 -1,183 -1,184 -1.698,185 2.602}
{0 CHEMBL1650753,1 3.161,2 2.078,3 12.595,4 9.022,5 5.159,6 3.566,7 2.64,8 98.41,9 9.175,10 3.82,11 3.28,12 9.347,13 8.22,14 0.857,15 3.197,16 3.119,17 3.005,18 2.857,19 43.327,20 4.262,21 3.879,22 2.806,23 32.731,24 3.083,25 0.609,26 1.953,28 1,31 1,32 1,33 1,34 1,37 0.873,38 3,39 1.494,40 1.953,41 0.66,42 -0.234,43 0.35,44 7.4,45 1,46 8.8,47 3.3,48 48.268,49 70.627,52 92.274,53 3.72,54 3.727,55 6.435,56 1.067,57 1.028,58 1,59 3.8,60 4.244,61 5,62 18.5,63 144.817,64 1.248,65 3.8,66 112.39,67 122.2,68 1.516,69 0.871,70 3.199,72 13.933,73 15.032,74 16.143,75 11.03,76 55.652,77 3.391,78 4.687,79 17.697,80 4.311,81 10.793,82 0.675,83 40.7,84 3.927,85 115.905,86 274.568,87 6.009,88 4.674,89 2.39,90 1.421,91 3.249,92 3.221,93 2.863,94 2.751,95 2.573,96 0.785,97 0.828,98 0.398,99 0.826,100 74.264,101 -0.025,102 0.286,103 0.553,104 91.108,105 1,106 8,107 144.817,108 165.952,109 165.952,110 165.952,111 3.144,112 0.948,113 85.302,114 0.888,115 5.168,116 1.021,117 4.8,118 2.911,119 2.925,120 2.087,121 17.086,122 0.391,123 0.411,124 0.589,125 0.398,126 2.87,127 3.132,128 0.595,129 0.54,130 0.437,131 0.368,132 0.274,133 1,134 274,135 223,136 116,137 3.103,138 3.088,139 2.674,140 1.697,141 2.117,142 1.645,143 2.8,144 1.939,145 2.235,146 1.233,147 1.702,148 2.775,149 1.231,150 2.115,151 3.189,152 1.606,153 0.783,154 1.351,155 0.587,156 1,157 0.09,158 0.536,159 -0.514,160 -0.662,161 -0.524,162 0.652,163 -0.252,164 2,165 0.165,166 -0.844,167 -1,168 -2.101,169 -0.856,170 2,172 -1,173 -3,174 1.773,175 -0.061,176 -1,177 1.48,178 -0.316,179 -1.354,180 -3.62,181 -1.38,182 -0.315,183 -1.061,184 -1.813,185 3}
{0 CHEMBL1650754,1 3.104,2 1.971,3 12.432,4 8.867,5 4.824,6 3.546,7 2.491,8 122.244,9 11.193,10 3.796,11 3.382,12 9.132,13 8.31,14 0.867,15 3.207,16 3.067,17 2.884,18 2.786,19 44.908,20 3.836,21 3.311,22 2.786,23 32.346,24 3.025,25 0.608,26 1.953,28 1,31 1,32 1,33 1,34 1,37 0.862,39 1.494,40 1.953,41 0.606,42 -0.218,43 0.318,44 7.4,45 2,46 8.79,47 3.29,48 48.562,49 82.398,52 92.274,53 3.738,54 3.755,55 6.435,56 1.136,57 1.028,58 1,59 3.758,60 4.091,61 5,62 18.5,63 144.817,64 1.248,65 3.758,66 112.39,67 122.2,68 1.516,69 0.877,70 5.234,72 13.772,73 14.871,74 15.985,75 9.478,76 56.84,77 3.309,78 4.808,79 15.062,80 4.536,81 10.597,82 0.662,83 40.7,84 3.866,85 115.905,86 274.568,87 6.175,88 4.776,89 2.395,90 1.412,91 3.225,92 3.183,93 2.764,94 2.662,95 2.602,96 0.773,97 0.889,98 0.37,99 0.813,100 74.264,101 -0.209,102 0.286,103 0.478,104 81.595,105 1,106 8,107 144.817,108 165.952,109 165.952,110 165.952,111 2.929,112 1.164,113 87.925,114 0.895,115 5.091,116 0.849,117 4.383,118 2.802,119 2.844,120 1.877,121 17.099,122 0.391,123 0.411,124 0.722,125 0.296,126 2.87,127 3.081,128 0.576,129 0.489,130 0.404,131 0.343,132 0.309,134 264,135 248,136 128,137 3.132,138 3.105,139 2.61,140 1.604,141 2.15,142 1.602,143 2.846,144 1.763,145 2.316,146 1.337,147 1.783,148 2.983,149 1.302,150 2.012,151 3.129,152 1.575,153 0.697,154 1.306,155 0.574,156 1,157 0.649,158 0.537,159 -0.514,160 -0.652,161 -0.525,162 0.7,163 -0.405,164 2,165 0.22,166 -0.778,167 -0.973,168 -1.921,169 -0.771,170 2,172 -1,173 -3,174 2,176 -1,177 1.379,178 -0.193,179 -1.205,180 -3.155,181 -1.223,182 -0.216,183 -1,184 -1.824,185 2.77}
{0 CHEMBL1650755,1 3.12,2 1.971,3 12.432,4 8.867,5 4.824,6 3.546,7 2.491,8 182.465,9 10.998,10 3.826,11 3.395,12 9.432,13 8.31,14 0.89,15 3.202,16 3.06,17 2.876,18 2.781,19 61.386,20 3.876,21 3.339,22 2.891,23 32.301,24 3.08,25 0.692,26 2.132,28 1,33 1,34 1,37 0.821,39 1.482,40 2.132,41 0.635,42 -0.187,43 0.226,44 7.4,45 2,46 9.047,47 3.547,48 48.207,49 70.627,52 92.274,53 3.743,54 3.759,55 7.409,56 1.135,57 0.955,58 1,59 3.824,60 4.246,61 5,62 18.5,63 144.817,64 1.248,65 3.824,66 112.39,67 122.2,68 1.516,69 0.877,70 3.192,72 13.865,73 14.962,74 16.073,75 9.216,76 56.968,77 3.496,78 4.818,79 14.964,80 4.571,81 11.753,82 0.691,83 37,84 3.986,85 117.103,86 277.492,87 6.28,88 4.902,89 2.466,90 1.442,91 3.219,92 3.222,93 2.817,94 2.695,95 2.637,96 0.797,97 0.769,98 0.37,99 0.838,100 74.264,101 -0.187,102 0.369,103 0.768,104 112.395,105 1,106 9,107 159.777,108 165.952,109 180.912,110 180.912,111 3.013,112 1.123,113 110.421,114 0.884,115 5.208,116 0.853,117 4.443,118 2.8,119 2.856,120 1.877,121 17.068,122 0.426,123 0.448,124 1.047,125 0.296,126 2.891,127 3.152,128 0.66,129 0.565,130 0.471,131 0.385,132 0.343,134 325,135 265,136 137,137 3.132,138 3.149,139 2.696,140 1.725,141 2.205,142 1.663,143 2.965,144 2.212,145 2.422,146 1.44,147 1.951,148 3.143,149 1.402,150 2.19,151 3.324,152 1.758,153 0.953,154 1.777,155 0.742,156 1,157 0.809,158 0.543,159 -0.47,160 -0.567,161 -0.441,162 0.824,163 0.051,164 2.178,165 0.383,166 -0.589,167 -0.772,168 -1.395,169 -0.585,170 2,172 -1,173 -2.44,174 2,176 -0.972,177 1.51,178 -0.032,179 -1,180 -3,181 -1,182 -0.078,183 -1,184 -1.689,185 3}
{0 CHEMBL1650756,1 3.562,2 2.317,3 13.802,4 9.746,5 5.812,6 3.965,7 3.123,8 138.111,9 11.982,10 3.969,11 3.488,12 10.188,13 9.009,14 1.014,15 3.274,16 3.158,17 2.985,18 2.857,19 50.507,20 4.518,21 3.612,22 3.505,23 32.691,24 3.278,25 0.648,26 2.132,28 1,32 1,33 1,34 1,37 0.872,39 1.482,40 2.132,41 0.635,42 -0.219,43 0.296,44 7.4,45 2,46 8.819,47 3.319,48 42.587,49 70.627,52 92.274,53 3.741,54 3.755,55 6.435,56 1.136,57 1.025,58 1,59 3.826,60 4.246,61 5,62 18.5,63 144.817,64 1.248,65 3.826,66 112.39,67 122.2,68 1.576,69 0.877,70 3.811,72 13.815,73 14.913,74 16.025,75 13.041,76 61.556,77 3.64,78 5.292,79 16.163,80 5.11,81 12.505,82 0.736,83 37,84 3.986,85 124.238,86 294.9,87 6.658,88 5.309,89 2.735,90 1.607,91 3.293,92 3.265,93 2.875,94 2.732,95 2.676,96 0.797,97 0.769,98 0.37,99 0.838,100 74.264,101 -0.141,102 0.333,103 0.615,104 91.444,105 1,106 9,107 144.817,108 165.952,109 165.952,110 165.952,111 3.083,112 0.965,113 95.027,114 0.89,115 5.142,116 0.857,117 4.443,118 2.839,119 2.875,120 1.883,121 17.145,122 0.426,123 0.448,124 0.884,125 0.296,126 2.916,127 3.214,128 0.559,129 0.478,130 0.391,131 0.337,132 0.303,134 325,135 265,136 137,137 3.132,138 3.149,139 2.686,140 1.725,141 2.205,142 1.637,143 2.965,144 2.224,145 2.413,146 1.44,147 1.951,148 3.143,149 1.37,150 2.19,151 3.324,152 1.734,153 0.953,154 1.777,155 0.695,156 1,157 0.809,158 0.541,159 -0.47,160 -0.567,161 -0.392,162 0.824,163 0.063,164 2.178,165 0.35,166 -0.589,167 -0.772,168 -1.395,169 -0.558,170 2,172 -1,173 -2.44,174 2,176 -0.968,177 1.51,178 -0.068,179 -1,180 -3,181 -1,182 -0.078,183 -1,184 -1.689,185 3.886}
{0 CHEMBL1650757,1 4.025,2 2.388,3 14.302,4 10.117,5 6.214,6 4.184,7 3.405,8 123.202,9 14.862,10 4.436,11 3.732,12 11.018,13 9.298,14 1.151,15 3.311,16 3.207,17 3.039,18 2.895,19 47.266,20 5.313,21 3.991,22 4.571,23 32.827,24 3.363,25 0.628,26 2.132,28 1,32 1,33 1,34 1,37 0.873,39 1.482,40 2.132,41 0.635,42 -0.22,43 0.309,44 7.4,45 2,46 8.739,47 3.239,48 88.095,49 70.627,52 92.274,53 3.74,54 3.754,55 6.435,56 1.136,57 1.045,58 1,59 3.822,60 4.246,61 5,62 18.5,63 144.817,64 1.248,65 3.822,66 112.39,67 122.2,68 1.814,69 0.877,70 4.028,72 13.802,73 14.9,74 16.013,75 24.139,76 64.374,77 3.951,78 5.838,79 18.865,80 5.731,81 13.95,82 0.821,83 37,84 3.986,85 127.819,86 303.638,87 7.073,88 5.756,89 3.031,90 1.788,91 3.331,92 3.284,93 2.899,94 2.749,95 2.693,96 0.797,97 0.769,98 0.37,99 0.838,100 74.264,101 -0.117,102 0.315,103 0.541,104 84.837,105 1,106 9,107 144.817,108 165.952,109 165.952,110 165.952,111 3.252,112 0.712,113 91.176,114 0.897,115 5.118,116 0.858,117 4.443,118 2.879,119 2.886,120 1.921,121 17.173,122 0.426,123 0.448,124 0.801,125 0.296,126 2.926,127 3.364,128 0.604,129 0.518,130 0.428,131 0.361,132 0.329,134 325,135 265,136 137,137 3.132,138 3.149,139 2.683,140 1.725,141 2.205,142 1.628,143 2.965,144 2.204,145 2.411,146 1.44,147 1.951,148 3.143,149 1.356,150 2.19,151 3.324,152 1.727,153 0.953,154 1.777,155 0.673,156 1,157 0.809,158 0.541,159 -0.47,160 -0.567,161 -0.358,162 0.824,163 0.044,164 2.178,165 0.341,166 -0.589,167 -0.772,168 -1.395,169 -0.549,170 2,172 -1,173 -2.44,174 2,176 -0.975,177 1.51,178 -0.078,179 -1,180 -3,181 -1,182 -0.078,183 -1,184 -1.689,185 4.699}
{0 CHEMBL1650758,1 3.586,2 2.287,3 13.302,4 9.375,5 5.409,6 3.745,7 2.841,8 104.957,9 12.79,10 3.827,11 3.399,12 10.054,13 8.72,14 0.992,15 3.315,16 3.232,17 3.09,18 2.976,19 41.088,20 4.618,21 4.209,22 3.388,23 32.902,24 3.121,25 0.625,26 1.899,28 2,31 1,32 2,33 1,34 1,37 0.846,38 3,39 1.424,40 1.899,41 0.635,42 -0.208,43 0.324,44 6.7,45 2,46 8.694,47 3.194,48 51.097,49 105.94,52 92.274,53 3.75,54 3.767,55 6.435,56 1.14,57 1.001,58 1,59 3.8,60 4.246,61 5,62 16.7,63 144.817,64 1.248,65 3.8,66 112.39,67 122.2,68 1.871,69 0.861,70 4.148,72 13.934,73 15.032,74 16.143,75 10.366,76 61.122,77 3.443,78 5.343,79 18.81,80 4.957,81 12.612,82 0.742,83 43.3,84 3.827,85 125.497,86 297.973,87 6.591,88 5.237,89 2.687,90 1.578,91 3.358,92 3.316,93 2.96,94 2.835,95 2.735,96 0.746,97 1.08,98 0.492,99 0.78,100 74.264,101 -0.062,102 0.265,103 0.439,104 99.23,105 1,106 8,107 144.817,108 165.952,109 165.952,110 165.952,111 3.013,112 1.073,113 91.619,114 0.972,115 5.287,116 0.886,117 5.3,118 2.956,119 2.98,120 2.313,121 17.188,122 0.37,123 0.387,124 0.63,125 0.425,126 2.953,127 3.137,128 0.666,129 0.602,130 0.5,131 0.427,132 0.367,134 325,135 265,136 137,137 3.132,138 3.149,139 2.708,140 1.725,141 2.205,142 1.685,143 2.965,144 1.996,145 2.432,146 1.44,147 1.951,148 3.143,149 1.423,150 2.19,151 3.324,152 1.787,153 0.953,154 1.777,155 0.772,156 1,157 0.809,158 0.546,159 -0.47,160 -0.567,161 -0.459,162 0.824,163 -0.173,164 2.178,165 0.427,166 -0.589,167 -0.772,168 -1.395,169 -0.602,170 2,171 0.01,172 -1,173 -2.44,174 2,176 -1,177 1.51,179 -1,180 -3,181 -1.011,182 -0.078,183 -1,184 -1.689,185 4.62}
{0 CHEMBL1650759,1 3.481,2 2.201,3 13.139,4 9.221,5 5.074,6 3.723,7 2.617,8 183.368,9 10.779,10 3.83,11 3.473,12 10.139,13 8.81,14 1.001,15 3.305,16 3.189,17 3.018,18 2.886,19 57.333,20 4.545,21 3.69,22 3.309,23 32.444,24 3.108,25 0.7,26 2.068,27 1,28 2,29 1,33 2,34 1,37 0.795,39 1.415,40 2.068,41 0.611,42 -0.167,43 0.243,44 6.7,45 3,46 8.934,47 3.434,48 50.742,49 94.169,52 92.274,53 3.764,54 3.788,55 7.409,56 1.233,57 0.923,58 1,59 3.824,60 4.246,61 5,62 16.7,63 144.817,64 1.248,65 3.824,66 112.39,67 122.2,68 1.691,69 0.879,70 3.692,72 13.866,73 14.962,74 16.073,75 12.436,76 61.723,77 3.54,78 5.82,79 17.794,80 5.204,81 13.277,82 0.738,83 40,84 3.965,85 126.695,86 300.897,87 6.78,88 5.314,89 2.864,90 1.652,91 3.351,92 3.313,93 2.933,94 2.809,95 2.731,96 0.773,97 0.942,98 0.4,99 0.808,100 74.264,101 -0.186,102 0.346,103 0.757,104 100.915,105 1,106 9,107 159.777,108 165.952,109 180.912,110 180.912,111 2.988,112 1.087,113 108.927,114 0.96,115 5.13,116 1.022,117 4.943,118 2.903,119 2.904,120 2.136,121 17.156,122 0.403,123 0.422,124 1.059,125 0.333,126 2.973,127 3.022,128 0.74,129 0.634,130 0.535,131 0.442,132 0.407,134 376,135 311,136 160,137 3.103,138 3.187,139 2.742,140 1.759,141 2.257,142 1.724,143 2.997,144 2.237,145 2.532,146 1.56,147 1.996,148 3.384,149 1.5,150 2.255,151 3.427,152 1.958,153 1.106,154 2.168,155 0.948,156 1.023,157 0.814,158 0.808,159 -0.154,160 -0.167,161 -0.145,162 1,163 0.169,164 2.445,165 0.538,166 -0.506,167 -0.636,168 -1.243,169 -0.509,170 2,171 0.201,172 -0.746,173 -1.805,174 2,175 0.125,176 -0.943,177 1.825,179 -1,180 -3,181 -1,183 -1,184 -1.582,185 2.721}
{0 CHEMBL1650760,1 3.775,2 2.495,3 14.509,4 10.099,5 6.062,6 4.141,7 3.249,8 140.036,9 11.522,10 3.97,11 3.535,12 10.895,13 9.509,14 1.125,15 3.371,16 3.276,17 3.113,18 2.954,19 47.738,20 5.117,21 4.164,22 3.826,23 32.828,24 3.326,25 0.658,26 2.068,27 1,28 2,29 1,32 1,33 2,34 1,35 1,37 0.844,39 1.415,40 2.068,41 0.611,42 -0.196,43 0.31,44 6.7,45 3,46 8.718,47 3.218,48 45.121,49 94.169,52 92.274,53 3.762,54 3.784,55 6.435,56 1.233,57 0.989,58 1,59 3.826,60 4.246,61 5,62 16.7,63 144.817,64 1.248,65 3.826,66 112.39,67 122.2,68 1.698,69 0.879,70 4.312,72 13.816,73 14.913,74 16.026,75 14.473,76 66.311,77 3.679,78 6.352,79 19.096,80 5.787,81 14.052,82 0.781,83 40,84 3.965,85 133.83,86 318.306,87 7.158,88 5.721,89 3.133,90 1.817,91 3.416,92 3.352,93 2.985,94 2.842,95 2.767,96 0.773,97 0.942,98 0.4,99 0.808,100 74.264,101 -0.144,102 0.312,103 0.603,104 81.375,105 1,106 9,107 144.817,108 165.952,109 165.952,110 165.952,111 3.06,112 0.938,113 96.663,114 0.964,115 5.058,116 1.008,117 4.943,118 2.922,119 2.919,120 2.14,121 17.22,122 0.403,123 0.422,124 0.888,125 0.333,126 2.995,127 3.092,128 0.64,129 0.55,130 0.453,131 0.4,132 0.361,134 376,135 311,136 160,137 3.103,138 3.187,139 2.736,140 1.759,141 2.257,142 1.71,143 2.997,144 2.248,145 2.521,146 1.56,147 1.996,148 3.384,149 1.461,150 2.255,151 3.427,152 1.946,153 1.106,154 2.168,155 0.92,156 1.023,157 0.814,158 0.789,159 -0.154,160 -0.167,161 -0.131,162 1,163 0.175,164 2.445,165 0.538,166 -0.506,167 -0.636,168 -1.243,169 -0.5,170 2,171 0.155,172 -0.746,173 -1.805,174 2,175 0.125,176 -0.94,177 1.825,179 -1,180 -3,181 -1,183 -1,184 -1.582,185 3.824}
{0 CHEMBL1650761,1 4.16,2 2.619,3 15.009,4 10.47,5 6.464,6 4.361,7 3.532,8 125.021,9 13.385,10 4.436,11 3.74,12 11.725,13 9.798,14 1.262,15 3.404,16 3.319,17 3.161,18 2.989,19 44.681,20 5.858,21 4.639,22 4.443,23 32.962,24 3.445,25 0.639,26 2.068,27 1,28 2,29 1,32 1,33 2,34 1,35 1,37 0.847,39 1.415,40 2.068,41 0.611,42 -0.197,43 0.322,44 6.7,45 3,46 8.642,47 3.142,48 90.63,49 94.169,52 92.274,53 3.762,54 3.783,55 6.435,56 1.233,57 1.01,58 1,59 3.822,60 4.246,61 5,62 16.7,63 144.817,64 1.248,65 3.822,66 112.39,67 122.2,68 1.858,69 0.879,70 4.529,72 13.803,73 14.9,74 16.014,75 20.707,76 69.129,77 3.979,78 6.907,79 21.947,80 6.431,81 15.539,82 0.863,83 40,84 3.965,85 137.411,86 327.043,87 7.573,88 6.168,89 3.429,90 1.999,91 3.449,92 3.37,93 3.007,94 2.857,95 2.782,96 0.773,97 0.942,98 0.4,99 0.808,100 74.264,101 -0.122,102 0.295,103 0.529,104 75.108,105 1,106 9,107 144.817,108 165.952,109 165.952,110 165.952,111 3.233,112 0.696,113 93.101,114 0.968,115 5.032,116 0.994,117 4.943,118 2.947,119 2.928,120 2.147,121 17.242,122 0.403,123 0.422,124 0.8,125 0.333,126 3.005,127 3.259,128 0.686,129 0.59,130 0.49,131 0.425,132 0.386,134 376,135 311,136 160,137 3.103,138 3.187,139 2.734,140 1.759,141 2.257,142 1.706,143 2.997,144 2.23,145 2.517,146 1.56,147 1.996,148 3.384,149 1.445,150 2.255,151 3.427,152 1.943,153 1.106,154 2.168,155 0.908,156 1.023,157 0.814,158 0.783,159 -0.154,160 -0.167,161 -0.121,162 1,163 0.165,164 2.445,165 0.538,166 -0.506,167 -0.636,168 -1.243,169 -0.489,170 2,171 0.143,172 -0.746,173 -1.805,174 2,175 0.125,176 -0.945,177 1.825,179 -1,180 -3,181 -1,183 -1,184 -1.582,185 3.796}
{0 CHEMBL1650762,1 3.97,2 2.412,3 14.009,4 9.729,5 5.659,6 3.922,7 2.967,8 105.703,9 12.743,10 3.831,11 3.476,12 10.761,13 9.22,14 1.103,15 3.408,16 3.342,17 3.206,18 3.063,19 38.545,20 5.307,21 4.518,22 3.784,23 33.036,24 3.144,25 0.627,26 1.849,27 1,28 3,29 1,31 1,32 2,33 2,34 1,35 1,37 0.828,38 3,39 1.361,40 1.849,41 0.611,42 -0.19,43 0.331,44 6.1,45 3,46 8.6,47 3.1,48 53.631,49 129.482,52 92.274,53 3.77,54 3.795,55 6.435,56 1.234,57 0.98,58 1,59 3.8,60 4.246,61 5,62 15.2,63 144.817,64 1.248,65 3.8,66 112.39,67 122.2,68 2.125,69 0.864,70 4.648,72 13.935,73 15.032,74 16.143,75 13.66,76 65.877,77 3.49,78 6.347,79 21.423,80 5.577,81 14.162,82 0.787,83 45.5,84 3.793,85 135.09,86 321.379,87 7.091,88 5.649,89 3.086,90 1.788,91 3.473,92 3.399,93 3.062,94 2.934,95 2.821,96 0.723,97 1.251,98 0.508,99 0.752,100 74.264,101 -0.081,102 0.245,103 0.409,104 87.56,105 1,106 8,107 144.817,108 165.952,109 165.952,110 165.952,111 2.988,112 1.061,113 92.43,114 1.015,115 5.215,116 1.019,117 5.8,118 3.002,119 3.012,120 2.403,121 17.255,122 0.352,123 0.367,124 0.612,125 0.447,126 3.03,127 3.004,128 0.746,129 0.674,130 0.561,131 0.49,132 0.425,134 376,135 311,136 160,137 3.103,138 3.187,139 2.75,140 1.759,141 2.257,142 1.736,143 2.997,144 2.056,145 2.544,146 1.56,147 1.996,148 3.384,149 1.526,150 2.255,151 3.427,152 1.974,153 1.106,154 2.168,155 0.967,156 1.023,157 0.814,158 0.831,159 -0.154,160 -0.167,161 -0.151,162 1,163 0.111,164 2.445,165 0.538,166 -0.506,167 -0.636,168 -1.243,169 -0.512,170 2,171 0.258,172 -0.746,173 -1.805,174 2,175 0.125,176 -0.979,177 1.825,179 -1,180 -3,181 -1,183 -1,184 -1.582,185 4}
{0 CHEMBL1928428,1 7.636,2 3.142,3 20.922,4 12.808,5 10.674,6 8.148,7 6.449,8 165.202,9 25.15,10 3.881,11 3.692,12 16.751,13 13.567,14 2.16,15 3.864,16 3.953,17 3.839,18 3.811,19 61.967,20 8.069,21 8.461,22 7.982,23 35.866,24 3.467,25 1.36,26 2.054,27 1,28 3,29 4,30 4,31 1,32 1,33 1,34 3,35 2,37 0.647,38 3,39 1.76,40 2.054,41 0.595,42 -0.091,43 0.275,44 8.2,45 2,46 8.662,47 3.162,48 82.48,49 141.253,50 2.912,51 -1.748,52 96.716,53 3.914,54 3.943,55 7.448,56 1.249,57 0.732,59 4.475,60 4.307,61 5,62 10.2,63 129.118,65 4.475,66 125.45,67 125.45,68 2.736,69 0.881,70 1.301,71 5.598,72 13.937,73 14.977,74 16.047,75 24.953,76 100.643,77 4.29,78 8.999,79 37.08,80 9.623,81 29.734,82 0.959,83 36.7,84 4.304,85 199.846,86 479.385,87 9.397,88 7.331,89 5.048,90 3.403,91 4.01,92 4.031,93 3.872,94 3.816,95 3.775,96 0.735,97 1.311,98 0.454,99 0.767,100 53.683,101 -0.013,102 0.439,103 1.732,104 245.426,105 2,106 13,107 173.998,108 186.275,109 231.155,110 231.155,111 4.001,112 0.629,113 189.723,114 1.096,115 6.249,116 1.052,117 8.721,118 3.145,119 3.202,120 2.9,121 9.547,122 0.351,123 0.366,124 1.425,125 0.276,126 3.515,127 4.096,128 1.519,129 1.5,130 1.388,131 1.241,132 1.125,134 1619,135 769,136 370,137 3.579,138 3.856,139 3.535,140 2.595,141 3.035,142 2.427,143 3.661,144 3.207,145 3.39,146 2.42,147 2.823,148 7.517,149 2.325,150 3.516,151 5.288,152 3.14,153 2.668,154 6.484,155 2.007,156 3.12,157 2.395,158 2.776,159 1.808,160 2.153,161 1.631,162 2.713,163 2.054,164 4.281,165 2.364,166 1.396,167 1.64,168 3.848,169 1.339,170 4.224,171 2.237,172 1.295,173 3.679,174 4.031,175 1.703,176 1.373,177 3.121,178 1.419,179 0.438,180 1.004,181 0.416,182 1.456,183 0.946,184 0.301,185 4.022}
{0 CHEMBL211312,1 4.075,2 2.528,3 15.164,4 11.033,5 6.9,6 5.456,7 4.194,8 161.762,9 17.809,10 3.852,11 3.622,12 10.973,13 10.187,14 1.469,15 3.386,16 3.415,17 3.364,18 3.22,19 64.96,20 5.935,21 5.24,22 3.065,23 33.059,24 3.075,25 1.091,26 1.934,27 1,31 1,33 2,34 1,37 0.926,39 2.223,40 1.934,41 0.643,42 -0.237,43 0.291,44 6.1,45 2,46 8.782,47 3.282,48 34.631,49 82.398,52 134.958,53 3.731,54 3.753,55 6.45,56 1.207,57 1.123,58 2,59 3.806,60 4.205,61 8,62 24.2,63 205.422,64 3.143,65 3.806,66 151.08,67 160.89,68 1.96,69 0.903,70 2.335,71 9.552,72 13.942,73 15.025,74 16.123,75 13.917,76 62.272,77 3.709,78 6.049,79 21.532,80 5.975,81 16.273,82 0.814,83 39.4,84 4.062,85 133.02,86 316.329,87 7.142,88 5.475,89 3.258,90 2.202,91 3.482,92 3.486,93 3.314,94 3.219,95 2.9,96 0.774,97 0.982,98 0.303,99 0.805,100 134.869,101 -0.134,102 0.489,103 1.305,104 186.888,105 3,106 11,107 205.422,108 226.557,109 226.557,110 226.557,111 3.606,112 0.86,113 125.503,114 0.977,115 6.006,116 0.962,117 5.25,118 2.947,119 2.933,120 2.276,121 26.875,122 0.369,123 0.383,124 1.367,125 0.242,126 3.073,127 3.187,128 0.719,129 0.659,130 0.609,131 0.525,132 0.396,133 1,134 478,135 346,136 171,137 3.253,138 3.476,139 3.19,140 2.201,141 2.596,142 2.161,143 3.032,144 2.547,145 2.685,146 1.691,147 2.04,148 4.743,149 1.656,150 2.586,151 4.204,152 2.323,153 1.487,154 3.758,155 1.279,156 1.625,157 1.134,158 1.408,159 0.539,160 0.554,161 0.463,162 1.418,163 0.813,164 2.719,165 0.972,166 -0.047,167 -0.065,168 -0.113,169 -0.047,170 2.518,171 0.537,172 -0.515,173 -1.242,174 2.359,175 0.426,176 -0.56,177 2,179 -1,180 -2.884,181 -0.943,182 0.148,183 -0.792,184 -1.052,185 3.77}
{0 CHEMBL2179277,1 25.231,2 3.284,3 28.612,4 18.614,5 13.653,6 11.615,7 9.539,8 57.75,9 79.263,10 3.974,11 3.848,12 23.748,13 18.485,14 4.122,15 4.321,16 4.564,17 4.627,18 4.755,19 13.076,20 18.457,21 22.017,22 21.172,23 36.551,24 3.719,25 0.445,26 1.584,27 3,28 12,29 16,30 7,31 14,32 21,33 8,34 15,35 17,36 11,37 0.629,38 12,39 0.149,40 1.584,41 0.526,42 -0.054,43 0.204,44 4.2,45 5,46 7.873,47 2.373,48 201.44,49 364.904,50 12.605,51 2.71,52 60.694,53 3.909,54 3.94,55 6.351,56 1.454,57 0.74,58 1,59 3.822,60 4.295,61 5,62 6.9,63 129.118,65 3.822,66 104.63,67 104.63,68 2.905,69 0.787,70 1.652,71 6.082,72 14.615,73 15.706,74 16.825,75 74.193,76 148.254,77 4.519,78 16.749,79 66.187,80 19.502,81 47.735,82 1.256,83 47.2,84 3.782,85 282.379,86 680.764,87 13.572,88 12.086,89 7.352,90 5.432,91 4.537,92 4.444,93 4.526,94 4.628,95 4.608,96 0.59,97 2.388,98 1.128,99 0.613,101 0.096,102 0.053,103 0.757,104 83.825,105 1,106 9,107 129.118,108 153.377,109 153.377,110 153.377,111 4.591,112 0.57,113 57.218,114 1.324,115 6.424,116 0.916,117 13.993,118 3.646,119 3.639,120 3.021,121 9.834,122 0.247,123 0.257,124 0.383,125 0.667,126 3.86,127 4.652,128 2.179,129 2.462,130 2.436,131 2.697,132 2.937,134 3016,135 989,136 468,137 3.433,138 4.023,139 3.761,140 2.795,141 3.311,142 2.699,143 3.908,144 3.104,145 3.553,146 2.618,147 3.025,148 7.803,149 2.501,150 3.759,151 5.524,152 3.519,153 2.923,154 7.462,155 2.409,156 3.343,157 2.699,158 2.937,159 2.036,160 2.519,161 1.843,162 3.161,163 2.379,164 4.869,165 2.805,166 1.844,167 2.259,168 5.315,169 1.694,170 4.591,171 2.589,172 1.638,173 4.563,174 4.309,175 2.664,176 1.505,177 3.933,178 2.197,179 1.208,180 2.961,181 1.183,182 2.63,183 1.389,184 1.62,185 4.208}
{0 CHEMBL2179279,1 25.517,2 3.295,3 28.819,4 18.162,5 14.288,6 11.422,7 9.442,8 63.3,9 74.049,10 3.926,11 3.841,12 23.625,13 18.757,14 4.082,15 4.343,16 4.615,17 4.677,18 4.787,19 13.351,20 20.198,21 22.284,22 22.805,23 36.649,24 3.684,25 0.446,26 1.566,27 4,28 13,29 17,30 10,31 14,32 22,33 8,34 15,35 19,36 13,37 0.621,38 14,39 0.136,40 1.566,41 0.52,42 -0.048,43 0.197,44 4,45 6,46 7.885,47 2.385,48 158.466,49 388.446,50 12.153,51 2.222,52 60.694,53 3.909,54 3.941,55 6.351,56 1.465,57 0.726,58 1,59 3.822,60 4.296,61 5,62 6.7,63 129.118,65 3.822,66 104.63,67 104.63,68 3,69 0.785,70 1.652,71 6.054,72 14.732,73 15.84,74 16.973,75 71.766,76 150.037,77 4.464,78 16.927,79 60.754,80 19.779,81 48.395,82 1.241,83 48,84 3.731,85 288.39,86 695.432,87 13.718,88 11.564,89 7.991,90 5.321,91 4.563,92 4.478,93 4.565,94 4.668,95 4.672,96 0.578,97 2.498,98 1.159,99 0.599,101 0.08,102 0.051,103 0.835,104 85.285,105 1,106 9,107 129.118,108 153.377,109 153.377,110 153.377,111 4.558,112 0.698,113 58.936,114 1.357,115 6.455,116 0.992,117 14.493,118 3.674,119 3.666,120 3.022,121 9.856,122 0.242,123 0.251,124 0.411,125 0.52,126 3.887,127 4.59,128 2.24,129 2.553,130 2.619,131 2.793,132 3.053,134 3288,135 1012,136 480,137 3.438,138 4.027,139 3.775,140 2.811,141 3.33,142 2.71,143 3.933,144 3.121,145 3.558,146 2.618,147 3.082,148 7.805,149 2.503,150 3.76,151 5.524,152 3.521,153 2.923,154 7.462,155 2.425,156 3.343,157 2.707,158 2.943,159 2.036,160 2.52,161 1.849,162 3.163,163 2.385,164 4.869,165 2.809,166 1.845,167 2.26,168 5.317,169 1.713,170 4.592,171 2.593,172 1.638,173 4.565,174 4.312,175 2.664,176 1.508,177 3.994,178 2.199,179 1.21,180 2.977,181 1.186,182 2.63,183 1.39,184 1.62,185 4.363}
{0 CHEMBL2179281,1 21.769,2 3.314,3 28.233,4 17.345,5 13.946,6 11.676,7 9.272,8 62.171,9 67.431,10 3.969,11 3.848,12 23.369,13 18.839,14 3.97,15 4.306,16 4.519,17 4.596,18 4.675,19 12.095,20 18.814,21 20.846,22 21.476,23 36.505,24 3.712,25 0.434,26 1.584,27 6,28 12,29 13,30 9,31 13,32 18,33 9,34 11,35 17,36 15,37 0.608,38 12,39 0.149,40 1.584,41 0.436,42 -0.034,43 0.189,44 4.2,45 8,46 7.853,47 2.353,48 191.393,49 364.904,50 12.666,51 2.782,52 60.694,53 3.908,54 3.94,55 6.351,56 1.454,57 0.74,58 1,59 3.822,60 4.295,61 5,62 6.9,63 129.118,65 3.822,66 104.63,67 104.63,68 2.99,69 0.785,70 1.66,71 6.077,72 14.101,73 15.144,74 16.231,75 69.234,76 148.433,77 4.504,78 16.483,79 56.673,80 17.357,81 45.35,82 1.193,83 47.2,84 3.698,85 282.379,86 680.764,87 13.925,88 10.817,89 7.627,90 5.542,91 4.49,92 4.402,93 4.481,94 4.554,95 4.571,96 0.577,97 2.472,98 1.141,99 0.599,101 -0.001,102 0.053,103 0.703,104 86.211,105 1,106 9,107 129.118,108 153.377,109 153.377,110 153.377,111 4.553,112 0.594,113 53.908,114 1.339,115 6.36,116 0.952,117 13.243,118 3.6,119 3.6,120 3.023,121 9.821,122 0.247,123 0.257,124 0.449,125 0.41,126 3.86,127 4.635,128 2.115,129 2.272,130 2.381,131 2.565,132 2.655,134 3108,135 995,136 471,137 3.424,138 3.997,139 3.554,140 2.618,141 3.255,142 2.514,143 3.766,144 3.095,145 3.531,146 2.539,147 2.923,148 7.462,149 2.41,150 3.446,151 5.305,152 3.14,153 2.623,154 6.476,155 2.103,156 3.176,157 2.38,158 2.82,159 1.862,160 2.274,161 1.696,162 3.013,163 2.175,164 4.593,165 2.698,166 1.712,167 2.111,168 4.579,169 1.683,170 4.316,171 2.577,172 1.62,173 4.003,174 4.033,175 2.664,176 1.5,177 3.693,178 2.206,179 1.217,180 2.806,181 1.193,182 2.63,183 1.388,184 1.618,185 4.495}
{0 CHEMBL257695,1 4.688,2 2.773,3 17.448,4 12.112,5 7.945,6 6.158,7 5.101,8 137.263,9 19.917,10 3.881,11 3.685,12 12.804,13 11.635,14 1.761,15 3.509,16 3.612,17 3.598,18 3.478,19 59.976,20 6.335,21 5.529,22 3.58,23 33.962,24 3.277,25 1.104,26 2.026,27 1,28 1,31 1,32 1,33 3,34 2,37 0.802,38 3,39 1.332,40 2.026,41 0.606,42 -0.15,43 0.348,44 13.5,45 2,46 8.687,47 3.187,48 37.166,49 105.94,52 92.274,53 3.768,54 3.805,55 6.727,56 1.233,57 1.031,58 2,59 3.84,60 4.306,61 7,62 18.9,63 162.738,64 3.143,65 3.84,66 179.61,67 189.42,68 2.404,69 0.891,70 1.297,71 9.852,72 14.127,73 15.211,74 16.31,75 17.316,76 67.8415,77 3.862,78 6.258,79 24.123,80 5.997,81 19.981,82 0.869,83 37.8,84 4.149,85 153.144,86 365.432,87 7.986,88 6.157,89 3.771,90 2.551,91 3.636,92 3.641,93 3.56,94 3.481,95 3.287,96 0.76,97 1.06,98 0.345,99 0.797,100 74.264,101 -0.022,102 0.465,103 1.323,104 177.414,105 3,106 13,107 162.738,108 247.401,109 247.401,110 232.086,111 3.843,112 0.811,113 125.918,114 1.013,115 6.023,116 0.972,117 6.583,118 3.02,119 3.043,120 2.521,121 17.446,122 0.371,123 0.389,124 1.204,125 0.345,126 3.184,127 3.695,128 0.86,129 0.833,130 0.802,131 0.712,132 0.609,133 1,134 721,135 401,136 200,137 3.266,138 3.659,139 3.393,140 2.412,141 2.824,142 2.347,143 3.237,144 2.577,145 2.81,146 1.838,147 2.352,148 5.321,149 1.767,150 3.078,151 4.433,152 2.561,153 2.105,154 4.367,155 1.512,156 2.339,157 1.412,158 1.904,159 0.924,160 1.231,161 0.9,162 1.728,163 1.041,164 3.162,165 1.446,166 0.557,167 0.588,168 1.38,169 0.483,170 3.048,171 1.35,172 0.366,173 0.888,174 2.647,175 1,176 -0.166,177 2.49,178 0.538,179 -0.499,180 -1.241,181 -0.498,182 0.658,183 -0.209,184 -0.862,185 5.119}
{0 CHEMBL394429,1 5.075,2 2.595,3 16.034,4 11.541,5 7.492,6 5.611,7 4.611,8 145.706,9 20.844,10 3.871,11 3.643,12 11.895,13 10.597,14 1.621,15 3.477,16 3.535,17 3.498,18 3.38,19 60.914,20 6.731,21 6.042,22 3.903,23 33.605,24 3.153,25 1.119,26 1.897,27 1,28 1,31 1,32 1,33 2,34 1,37 0.912,38 3,39 2.156,40 1.897,41 0.657,42 -0.228,43 0.299,44 5.6,45 2,46 8.705,47 3.205,48 37.166,49 105.94,52 134.958,53 3.754,54 3.776,55 6.45,56 1.208,57 1.091,58 2,59 3.84,60 4.303,61 8,62 22.2,63 205.422,64 3.143,65 3.84,66 151.08,67 160.89,68 2.264,69 0.888,70 1.296,71 9.631,72 14.083,73 15.168,74 16.266,75 17.05,76 66.554,77 3.801,78 6.59,79 25.718,80 6.356,81 18.588,82 0.885,83 41.7,84 3.948,85 142.612,86 339.734,87 7.559,88 5.937,89 3.553,90 2.348,91 3.587,92 3.586,93 3.442,94 3.367,95 3.083,96 0.737,97 1.222,98 0.41,99 0.764,100 134.869,101 -0.023,102 0.464,103 1.257,104 207.849,105 3,106 11,107 205.422,108 226.557,109 226.557,110 226.557,111 3.683,112 0.81,113 130.476,114 1.011,115 6.102,116 1.023,117 6.167,118 3.014,119 3.026,120 2.41,121 27.017,122 0.354,123 0.367,124 1.274,125 0.354,126 3.141,127 3.298,128 0.813,129 0.768,130 0.706,131 0.625,132 0.504,133 1,134 552,135 365,136 181,137 3.272,138 3.615,139 3.373,140 2.396,141 2.724,142 2.322,143 3.13,144 2.577,145 2.798,146 1.825,147 2.163,148 5.287,149 1.755,150 2.717,151 4.289,152 2.378,153 1.645,154 3.936,155 1.349,156 1.721,157 1.405,158 1.451,159 0.56,160 0.591,161 0.486,162 1.542,163 1.038,164 3.096,165 1.352,166 0.369,167 0.42,168 0.908,169 0.361,170 2.647,171 0.541,172 -0.495,173 -1.238,174 2.524,175 0.592,176 -0.208,177 2.22,178 0.255,179 -0.733,180 -1.944,181 -0.728,182 0.422,183 -0.564,184 -1,185 5.191}
{0 CHEMBL395814,1 4.754,2 3.084,3 20.137,4 12.866,5 10.136,6 8.379,7 7.444,8 144.313,9 10.564,10 3.964,11 3.836,12 14.152,13 13.235,14 2.968,15 3.668,16 3.752,17 3.53,18 3.352,19 68.513,20 7.415,21 5.959,22 3.371,23 65.547,24 3.481,25 0.672,26 1.99,28 4,29 4,30 4,32 4,35 4,37 0.7,39 0.479,40 1.99,41 0.533,42 -0.084,43 0.294,44 5.9,46 8.846,47 3.346,48 73.663,49 130.99,50 7.08,51 -1.279,52 85.367,53 3.974,54 3.99,55 7.472,56 1.124,57 0.583,58 2,59 4.141,60 4.475,61 8,62 23.5,63 237.15,64 60.363,65 4.141,66 166.24,67 216.84,68 2.507,69 0.664,72 13.968,73 15.044,74 16.15,75 3.665,76 94.702,77 4.164,78 7.324,79 15.093,80 8.29,81 17.045,82 0.656,83 23.5,84 3.41,85 168.823,86 403.688,87 8.734,88 6.925,89 5.405,90 3.862,91 3.827,92 3.781,93 3.554,94 3.297,95 3.218,96 0.614,97 1.677,98 1.397,99 0.67,100 101.494,101 -0.036,102 0.387,103 1.311,104 128.078,105 2,106 12,107 237.15,108 248.49,109 248.49,110 237.15,111 3.913,112 0.709,113 147.521,114 1.089,115 5.441,116 1.188,117 6.133,118 3.045,119 3.121,120 2.692,121 18.109,122 0.358,123 0.391,124 0.708,125 1.118,126 3.306,127 3.594,128 0.916,129 0.977,130 0.824,131 0.627,132 0.528,133 4,134 936,135 552,136 274,137 3.821,138 3.786,139 3.222,140 2.265,141 3.264,142 2.172,143 3.642,144 3.529,145 3.187,146 2.202,147 2.934,148 6.089,149 2.143,150 3.556,151 5.147,152 3.125,153 2.862,154 5.994,155 2.039,156 2.866,157 2.238,158 2.191,159 1.204,160 1.922,161 1.179,162 2.531,163 1.277,164 3.581,165 2.005,166 1,167 1.475,168 2.422,169 0.994,170 3.581,171 2.005,172 1,173 2.421,174 3.236,175 1.187,176 1,177 2.578,178 0.731,179 -0.193,180 -0.498,181 -0.172,182 1,183 1,184 -0.637,185 5.815}
{0 CHEMBL403328,1 4.29,2 2.467,3 15.164,4 11.011,5 7.027,6 5.265,7 4.316,8 105.09,9 13.872,10 3.873,11 3.636,12 11.318,13 10.187,14 1.342,15 3.401,16 3.421,17 3.366,18 3.194,19 48.345,20 5.956,21 4.975,22 3.501,23 33.464,24 3.144,25 1.024,26 1.924,28 2,31 1,32 2,33 2,34 2,37 0.874,38 3,39 1.349,40 1.924,41 0.627,42 -0.23,43 0.364,44 6.1,45 1,46 8.624,47 3.124,48 53.584,49 94.169,52 92.274,53 3.746,54 3.766,55 6.437,56 1.048,57 1.068,58 2,59 3.852,60 4.303,61 7,62 21.2,63 162.738,64 3.143,65 3.852,66 130.85,67 140.66,68 2.113,69 0.881,70 4.405,71 9.696,72 14.004,73 15.09,74 16.191,75 13.006,76 66.458,77 3.676,78 6.042,79 20.62,80 5.723,81 15.827,82 0.791,83 39.4,84 4.062,85 135.689,86 322.841,87 7.151,88 5.454,89 3.117,90 2.029,91 3.481,92 3.472,93 3.308,94 3.167,95 2.867,96 0.769,97 0.982,98 0.387,99 0.805,100 92.185,101 -0.019,102 0.405,103 0.978,104 116.142,105 3,106 10,107 162.738,108 183.873,109 183.873,110 183.873,111 3.363,112 0.817,113 107.731,114 0.986,115 5.593,116 1.102,117 5.8,118 2.995,119 3.015,120 2.407,121 17.173,122 0.364,123 0.381,124 0.963,125 0.326,126 3.09,127 3.134,128 0.75,129 0.711,130 0.636,131 0.547,132 0.435,133 1,134 488,135 350,136 173,137 3.259,138 3.549,139 3.275,140 2.304,141 2.684,142 2.218,143 3.099,144 2.574,145 2.782,146 1.81,147 2.123,148 5.185,149 1.74,150 2.734,151 4.256,152 2.351,153 1.673,154 3.827,155 1.329,156 1.708,157 1.177,158 1.414,159 0.54,160 0.584,161 0.465,162 1.529,163 1.118,164 3.032,165 1.321,166 0.338,167 0.383,168 0.832,169 0.328,170 2.646,171 0.54,172 -0.498,173 -1.241,174 2.411,175 0.577,176 -0.538,177 2.06,178 0.083,179 -0.91,180 -2.725,181 -0.908,182 0.165,183 -0.657,184 -1.017,185 4.658}
{0 CHEMBL403527,1 5.619,2 2.725,3 16.741,4 11.732,5 7.81,6 5.934,7 4.872,8 109.257,9 14.863,10 3.891,11 3.687,12 12.318,13 11.135,14 1.501,15 3.485,16 3.583,17 3.553,18 3.455,19 53.162,20 7.035,21 6.345,22 4.738,23 33.851,24 3.165,25 1.02,26 1.907,28 4,29 2,30 1,31 1,32 2,33 4,34 4,35 2,36 1,37 0.894,38 3,39 1.248,40 1.907,41 0.631,42 -0.237,43 0.355,44 5.7,45 1,46 8.62,47 3.12,48 87.645,49 82.398,52 92.274,53 3.763,54 3.784,55 6.437,56 1.06,57 1.064,58 2,59 3.865,60 4.341,61 7,62 20,63 162.738,64 3.143,65 3.865,66 130.85,67 140.66,68 2.402,69 0.889,70 2.746,71 9.822,72 14.15,73 15.236,74 16.334,75 14.739,76 73.803,77 3.801,78 6.649,79 19.782,80 6.731,81 17.843,82 0.811,83 37.1,84 4.339,85 149.019,86 355.365,87 7.6,88 5.786,89 3.439,90 2.227,91 3.607,92 3.607,93 3.491,94 3.438,95 3.233,96 0.8,97 0.79,98 0.307,99 0.846,100 92.185,101 0.03,102 0.396,103 1.039,104 112.501,105 3,106 10,107 162.738,108 183.873,109 183.873,110 183.873,111 3.704,112 0.813,113 110.633,114 0.986,115 5.827,116 1.17,117 6.3,118 3.062,119 3.073,120 2.51,121 17.396,122 0.351,123 0.372,124 0.906,125 0.307,126 3.177,127 3.496,128 0.854,129 0.869,130 0.792,131 0.719,132 0.623,133 1,134 630,135 382,136 190,137 3.378,138 3.696,139 3.393,140 2.409,141 2.841,142 2.353,143 3.316,144 2.76,145 2.807,146 1.832,147 2.211,148 5.311,149 1.766,150 3.089,151 4.396,152 2.489,153 1.875,154 4.198,155 1.447,156 2.532,157 1.431,158 1.497,159 0.571,160 0.735,161 0.509,162 1.721,163 1.167,164 3.106,165 1.375,166 0.416,167 0.569,168 0.949,169 0.402,170 2.742,171 1.239,172 0.267,173 0.427,174 2.647,175 0.663,176 -0.202,177 2.378,178 0.256,179 -0.723,180 -1.943,181 -0.703,182 0.598,183 -0.439,184 -0.987,185 4.721}
{0 CHEMBL449771,1 7.359,2 2.909,3 18.527,4 11.059,5 8.495,6 6.067,7 5.168,8 72.85,9 28.164,10 3.9,11 3.68,12 14.713,13 12.03,14 1.898,15 3.777,16 3.826,17 3.738,18 3.647,19 15.678,20 9.074,21 7.56,22 6.092,23 33.521,24 3.591,25 0.39,26 1.701,27 5,28 11,29 12,30 10,31 7,32 7,33 5,34 5,35 5,36 2,37 0.606,38 8,39 0.337,40 1.701,41 0.463,42 -0.039,43 0.181,44 4.7,45 6,46 8.135,47 2.635,48 127.001,49 188.338,50 7.937,51 2.148,52 60.694,53 3.801,54 3.837,55 6.351,56 1.371,57 0.713,58 1,59 3.825,60 4.032,61 4,62 9.3,63 118.118,65 3.825,66 92.16,67 92.16,68 2.687,69 0.778,70 1.484,72 12.841,73 13.776,74 14.805,75 23.384,76 92.8,77 4.141,78 9.363,79 31.879,80 9.652,81 21.567,82 0.899,83 44.2,84 3.656,85 180.049,86 431.08,87 8.537,88 6.489,89 4.264,90 2.737,91 3.894,92 3.798,93 3.603,94 3.53,95 3.414,96 0.644,97 1.771,98 1.012,99 0.674,101 -0.066,102 0.092,103 0.414,104 63.333,105 1,106 7,107 118.118,108 139.253,109 139.253,110 139.253,111 3.724,112 0.579,113 48.698,114 1.189,115 5.546,116 0.983,117 7.46,118 3.275,119 3.275,120 2.735,121 8.587,122 0.3,123 0.313,124 0.482,125 0.651,126 3.36,127 3.658,128 1.129,129 1.095,130 0.965,131 0.868,132 0.783,134 874,135 605,136 297,137 3.436,138 3.55,139 3.238,140 2.234,141 2.711,142 2.214,143 3.436,144 2.608,145 3.089,146 2.101,147 2.676,148 5.182,149 2.048,150 3.025,151 4.459,152 2.58,153 2.041,154 4.466,155 1.558,156 2.5,157 1.674,158 2,159 1,160 1.5,161 1,162 2.177,163 1.084,164 3.358,165 1.823,166 0.828,167 0.966,168 1.85,169 0.811,170 2.978,171 1.623,172 0.668,173 1.534,174 2.665,175 1,176 0.636,177 2.537,178 0.709,179 -0.241,180 -0.576,181 -0.195,182 0.919,183 0.386,184 -0.627,185 4.036}
{0 CHEMBL604405,1 25.169,2 3.963,3 45.595,4 37.685,5 26.987,6 28.458,7 16.029,8 519.295,9 73.018,10 4.61,11 4.466,12 34.223,13 32.104,14 8.2,15 4.537,16 4.683,17 4.647,18 4.631,19 229.765,20 25.995,21 28.468,22 25.88,23 97.337,24 4.285,25 4.059,26 2.076,27 1,28 1,31 1,32 1,33 3,34 1,37 1.093,38 3,39 7.816,40 2.076,41 0.695,42 -0.345,43 0.349,44 7.8,45 3,46 8.85,47 3.35,48 65.183,49 164.795,50 2.139,51 -0.059,52 401.749,53 3.947,54 3.975,55 7.439,56 1.209,57 1.347,58 18,59 3.84,60 4.659,61 26,62 28.9,63 572.77,64 59.12,65 3.84,66 492.04,67 550.9,68 3.546,69 0.77,70 1.085,71 37.901,72 16.102,73 17.295,74 18.499,75 76.602,76 181.98,77 5.298,78 23.389,79 75.948,80 28.507,81 71.991,82 1.22,83 34.4,84 4.366,85 380.195,86 919.435,87 24.381,88 21.256,89 16.7,90 12.897,91 4.624,92 4.608,93 4.586,94 4.587,95 4.488,96 0.646,97 2.126,98 1.289,99 0.673,100 400.901,101 0.019,102 1.934,103 5.306,104 829.597,105 24,106 39,107 572.77,108 679.058,109 679.058,110 677.159,111 5.289,112 0.61,113 393.415,114 1.171,115 7.614,116 1.055,117 14.75,118 3.835,119 3.633,120 3.585,121 89.82,122 0.307,123 0.32,124 4.595,125 0.886,126 4.109,127 5.184,128 2.106,129 2.154,130 2.052,131 1.956,132 1.825,133 2,134 10275,135 2906,136 1361,137 3.527,138 4.507,139 4.217,140 3.246,141 3.853,142 3.046,143 4.324,144 3.425,145 4.069,146 3.13,147 3.655,148 10.527,149 3.02,150 4.303,151 6.547,152 4.03,153 3.6,154 10.338,155 2.938,156 4.123,157 3.131,158 3.816,159 2.83,160 3.324,161 2.79,162 3.992,163 3.048,164 6.096,165 3.756,166 2.784,167 3.296,168 8.879,169 2.675,170 6.051,171 3.63,172 2.632,173 8.682,174 5.891,175 3.615,176 2.586,177 5.763,178 3.313,179 2.387,180 7.535,181 2.202,182 3.131,183 2.572,184 2.324,185 5.222}
{0 CHEMBL604630,1 22.655,2 3.869,3 42.138,4 34.041,5 24.833,6 25.332,7 14.887,8 458.948,9 68.684,10 4.568,11 4.382,12 31.618,13 29.543,14 7.183,15 4.467,16 4.609,17 4.581,18 4.552,19 199.097,20 23.448,21 24.906,22 22.279,23 85.112,24 4.166,25 3.638,26 2.069,27 1,28 1,31 1,32 1,33 3,34 1,37 1.068,38 3,39 7.056,40 2.069,41 0.674,42 -0.328,43 0.326,44 8.2,45 3,46 8.779,47 3.279,48 65.183,49 164.795,50 2.18,51 -0.039,52 364.617,53 3.946,54 3.974,55 7.431,56 1.209,57 1.308,58 15,59 3.84,60 4.642,61 23,62 27.1,63 512.532,64 49.267,65 3.84,66 445.51,67 494.56,68 3.504,69 0.789,70 1.107,71 34.707,72 15.938,73 17.126,74 18.325,75 70.068,76 170.839,77 5.187,78 21.065,79 70.819,80 25.079,81 65.44,82 1.19,83 35.3,84 4.392,85 354.277,86 856.196,87 22.138,88 19.116,89 14.842,90 11.321,91 4.561,92 4.55,93 4.52,94 4.516,95 4.416,96 0.658,97 2.017,98 1.147,99 0.685,100 360.926,101 0.02,102 1.683,103 4.721,104 732.935,105 21,106 35,107 512.532,108 618.82,109 618.82,110 616.921,111 5.166,112 0.626,113 352.295,114 1.171,115 7.467,116 1.048,117 14.017,118 3.772,119 3.626,120 3.558,121 80.173,122 0.31,123 0.323,124 4.127,125 0.746,126 4.049,127 5.057,128 2.021,129 2.052,130 1.957,131 1.851,132 1.73,133 2,134 8384,135 2542,136 1186,137 3.516,138 4.42,139 4.145,140 3.157,141 3.758,142 3.041,143 4.304,144 3.385,145 4.064,146 3.121,147 3.6,148 10.341,149 2.94,150 4.202,151 6.53,152 3.943,153 3.52,154 10.122,155 2.879,156 4.012,157 3.119,158 3.763,159 2.798,160 3.314,161 2.681,162 3.931,163 2.912,164 6.052,165 3.654,166 2.657,167 3.012,168 8.683,169 2.645,170 5.891,171 3.373,172 2.395,173 7.929,174 5.763,175 3.131,176 2.572,177 5.236,178 2.826,179 1.9,180 5.87,181 1.755,182 3.058,183 2.241,184 2.163,185 5.097}
{0 CHEMBL605435,1 24.015,2 3.869,3 42.138,4 34.041,5 24.833,6 25.332,7 14.887,8 493.702,9 73.16,10 4.58,11 4.386,12 31.917,13 29.543,14 8.4,15 4.52,16 4.654,17 4.628,18 4.609,19 194.173,20 24.615,21 26.541,22 24.05,23 85.736,24 4.166,25 3.437,26 2.057,27 1,28 1,31 1,32 1,33 2,34 1,37 1.04,38 3,39 7.038,40 2.057,41 0.674,42 -0.305,43 0.28,44 8,45 4,46 8.743,47 3.243,48 65.183,49 164.795,50 2.196,51 -0.032,52 364.617,53 3.955,54 3.98,55 7.429,56 1.22,57 1.258,58 13,59 3.84,60 4.642,61 22,62 25.3,63 509.688,64 45.476,65 3.84,66 436.28,67 485.33,68 3.504,69 0.829,70 1.132,71 31.541,72 15.938,73 17.126,74 18.325,75 79.726,76 172.984,77 5.188,78 22.053,79 76.862,80 26.566,81 66.932,82 1.217,83 36.8,84 4.438,85 359.873,86 869.85,87 22.94,88 20.667,89 16.537,90 12.974,91 4.604,92 4.581,93 4.551,94 4.551,95 4.459,96 0.662,97 2.005,98 0.885,99 0.689,100 358.082,101 -0.007,102 1.57,103 4.678,104 743.788,105 17,106 34,107 509.688,108 615.976,109 615.976,110 614.077,111 5.156,112 0.778,113 358.28,114 1.171,115 7.446,116 1.075,117 14.35,118 3.779,119 3.652,120 3.563,121 80.826,122 0.307,123 0.319,124 4.268,125 0.417,126 4.069,127 5.056,128 2.123,129 2.167,130 2.077,131 1.987,132 1.878,133 2,134 8384,135 2542,136 1186,137 3.516,138 4.42,139 4.145,140 3.157,141 3.758,142 3.041,143 4.304,144 3.385,145 4.064,146 3.121,147 3.6,148 10.341,149 2.94,150 4.202,151 6.53,152 3.943,153 3.52,154 10.122,155 2.879,156 4.012,157 3.119,158 3.763,159 2.798,160 3.314,161 2.681,162 3.931,163 2.912,164 6.052,165 3.654,166 2.657,167 3.012,168 8.683,169 2.645,170 5.891,171 3.373,172 2.395,173 7.929,174 5.763,175 3.131,176 2.572,177 5.236,178 2.826,179 1.9,180 5.87,181 1.755,182 3.058,183 2.241,184 2.163,185 5.222}
{0 CHEMBL606084,1 26.52,2 3.965,3 45.595,4 37.685,5 26.987,6 28.458,7 16.029,8 555.783,9 77.696,10 4.621,11 4.473,12 34.522,13 32.104,14 9.417,15 4.586,16 4.725,17 4.691,18 4.684,19 225.348,20 27.154,21 30.109,22 27.675,23 97.977,24 4.286,25 3.898,26 2.067,27 1,28 1,31 1,32 1,33 2,34 1,37 1.065,38 3,39 7.799,40 2.067,41 0.695,42 -0.323,43 0.31,44 7.6,45 4,46 8.816,47 3.316,48 65.183,49 164.795,50 2.151,51 -0.053,52 401.749,53 3.957,54 3.981,55 7.435,56 1.22,57 1.299,58 16,59 3.84,60 4.659,61 25,62 27.2,63 569.927,64 55.33,65 3.84,66 482.81,67 541.67,68 3.551,69 0.813,70 1.109,71 34.795,72 16.102,73 17.295,74 18.499,75 86.841,76 184.126,77 5.298,78 24.375,79 82.316,80 29.998,81 73.512,82 1.246,83 35.9,84 4.423,85 385.791,86 933.09,87 25.183,88 22.808,89 18.395,90 14.55,91 4.664,92 4.638,93 4.615,94 4.62,95 4.528,96 0.652,97 2.1,98 1.01,99 0.678,100 398.058,101 -0.007,102 1.825,103 5.281,104 845.547,105 20,106 38,107 569.927,108 676.215,109 676.215,110 674.316,111 5.281,112 0.748,113 402.915,114 1.171,115 7.595,116 1.08,117 15.083,118 3.857,119 3.66,120 3.585,121 90.484,122 0.305,123 0.317,124 4.746,125 0.533,126 4.129,127 5.183,128 2.208,129 2.268,130 2.172,131 2.091,132 1.973,133 2,134 10275,135 2906,136 1361,137 3.527,138 4.507,139 4.217,140 3.246,141 3.853,142 3.046,143 4.324,144 3.425,145 4.069,146 3.13,147 3.655,148 10.527,149 3.02,150 4.303,151 6.547,152 4.03,153 3.6,154 10.338,155 2.938,156 4.123,157 3.131,158 3.816,159 2.83,160 3.324,161 2.79,162 3.992,163 3.048,164 6.096,165 3.756,166 2.784,167 3.296,168 8.879,169 2.675,170 6.051,171 3.63,172 2.632,173 8.682,174 5.891,175 3.615,176 2.586,177 5.763,178 3.313,179 2.387,180 7.535,181 2.202,182 3.131,183 2.572,184 2.324,185 5.398}
