{
  "data_set_description": {
    "collection_date": "November 2013",
    "creator": "Dr Jeremy Besnard, Dr Ivan Olier, Dr Noureddin Sadawi, Dr Larisa Soldatova, Dr Crina Grosan, Prof Ross King, Dr Richard Bickerton, Prof Andrew Hopkins and Dr Willem van Hoorn",
    "default_target_attribute": "pXC50",
    "description": "This dataset contains QSAR data (from ChEMBL version 17) showing activity values (unit is pseudo-pCI50) of several compounds on drug target ChEMBL_ID: CHEMBL2669 (TID: 17130), and it has 36 rows and 43 features (not including molecule IDs and class feature: molecule_id and pXC50). The features represent Basic Molecular Descriptors which were generated from SMILES strings.  Missing value imputation was applied to this dataset (By choosing the Median).",
    "description_version": "1",
    "file_id": "3398999",
    "format": "ARFF",
    "id": "29665",
    "licence": "Public",
    "md5_checksum": "1c8c5a4f7795462ebf9594f425f9d74f",
    "minio_url": "https://data.openml.org/datasets/0002/29665/dataset_29665.pq",
    "name": "QSAR-DATASET-FOR-DRUG-TARGET-CHEMBL2669",
    "original_data_url": "https://www.ebi.ac.uk/chembl/target/inspect/CHEMBL2669",
    "parquet_url": "https://data.openml.org/datasets/0002/29665/dataset_29665.pq",
    "processing_date": "2018-10-04 01:33:14",
    "row_id_attribute": "molecule_id",
    "status": "deactivated",
    "tag": [
      "MetaQSAR",
      "study_13"
    ],
    "upload_date": "2016-07-15T03:04:14",
    "url": "https://api.openml.org/data/v1/download/3398999/QSAR-DATASET-FOR-DRUG-TARGET-CHEMBL2669.arff",
    "version": "9",
    "visibility": "public"
  }
}